program: Orca
programVersion: 5.0.2
elementType: H C C C C F C C H C O F F F C C C H H H H H C H O N H C C H C C H C H C H H C H H H
charge: 0
multiplicity: 1
keywords: wb97x-d3
keywords: def2-TZVPP
keywords: def2/J RIJCOSX
keywords: DEFGRID2
keywords: scfconv7
keywords: smallprint printgap noloewdin
keywords: NOSOSCF
formula: C18H17F4NO2
InChI: InChI=1/C18H17F4NO2/c1-2-16(17(24)23-11-12-6-4-3-5-7-12)25-13-8-9-15(19)14(10-13)18(20,21)22/h3-10,16,23H,2,11H2,1H3
42 atoms
H  -0.351325 -0.874063 1.037325
C  0.180492 -1.116767 0.129431
C  1.567836 -1.008342 0.128433
C  2.296707 -0.655789 1.39343
C  2.266427 -1.303841 -1.027775
F  3.599683 -1.232112 -1.044318
C  1.608496 -1.688959 -2.179567
C  0.233005 -1.804358 -2.172123
H  -0.2910 -2.121098 -3.064213
C  -0.490585 -1.526571 -1.015922
O  -1.833085 -1.693335 -1.105063
F  1.459933 -0.225411 2.340402
F  3.211044 0.29814 1.21305
F  2.935059 -1.722894 1.886882
C  -2.638213 -1.415525 0.026493
C  -4.037387 -1.939636 -0.273668
C  -4.992713 -1.778258 0.900652
H  -3.946336 -2.996969 -0.532582
H  -4.43726 -1.434119 -1.156423
H  -4.600079 -2.249339 1.802147
H  -5.949381 -2.246789 0.673641
H  -5.185677 -0.733229 1.137569
C  -2.646431 0.082152 0.347724
H  -2.251997 -1.931131 0.914113
O  -2.665396 0.479325 1.493277
N  -2.667544 0.890258 -0.735292
H  1.918815 2.39183 -2.519827
C  1.325257 2.476131 -1.618991
C  -0.055007 2.379506 -1.688279
H  -0.530683 2.224417 -2.650774
C  -0.834012 2.48543 -0.540208
C  -0.205555 2.687079 0.682767
H  -0.800264 2.750695 1.585075
C  1.175976 2.790357 0.754062
H  1.653888 2.949175 1.711515
C  1.944056 2.683935 -0.395173
H  3.021227 2.762017 -0.338536
H  2.177615 -1.910667 -3.072081
C  -2.32675 2.296393 -0.624256
H  -2.505976 0.459361 -1.631081
H  -2.825038 2.706464 0.252436
H  -2.735155 2.810207 -1.495892
totalener: -1300.90383596 hartree
nucrepener: 2410.63045567 hartree
electener: -3711.53429163 hartree
oneelecener: -6577.07670526 hartree
twoeener: 2865.54241362 hartree
kineticenergy: 1295.85097731 hartree
xcener: -118.331578691562 hartree
chargesum: -0.0000000
charge: 0.124471 -0.095072 -0.163577 0.547182 0.215300 -0.192588 -0.140848 -0.207005 0.123526 0.255370 -0.309251 -0.172538 -0.167838 -0.166676 0.127044 -0.103239 -0.253997 0.078739 0.070312 0.083240 0.088198 0.091754 0.207273 0.105583 -0.377909 -0.169547 0.122084 -0.129927 -0.192754 0.103582 0.064078 -0.123500 0.123769 -0.142052 0.133434 -0.125492 0.131174 0.125003 -0.051666 0.141217 0.107153 0.115994
qa: 0.1245 -0.0951 -0.1636 0.5472 0.2153 -0.1926 -0.1408 -0.2070 0.1235 0.2554 -0.3093 -0.1725 -0.1678 -0.1667 0.1270 -0.1032 -0.2540 0.0787 0.0703 0.0832 0.0882 0.0918 0.2073 0.1056 -0.3779 -0.1695 0.1221 -0.1299 -0.1928 0.1036 0.0641 -0.1235 0.1238 -0.1421 0.1334 -0.1255 0.1312 0.1250 -0.0517 0.1412 0.1072 0.1160
va: 1.0567 3.7428 3.6762 4.4171 4.0879 1.1086 3.9249 4.0205 1.0155 3.8791 2.0890 1.1281 1.1310 1.1372 3.8148 3.9140 3.9443 1.0166 1.0168 1.0060 1.0021 1.0095 4.1481 1.0115 2.1366 3.1389 1.0011 3.9377 3.9637 1.0114 3.5057 3.9374 1.0214 3.9043 1.0017 3.8903 1.0020 1.0051 3.8895 1.0453 1.0206 0.9985
dispcorr: -0.025754231 hartree
energy: -1300.929590190688
dipole: -36.67308 35.68916 -0.98392 5.58753 -5.81190 -0.22436 -10.47633 8.85789 -1.61844
magnitude: 1.90730 au
magnitude: 4.84798 debye
