program: Orca
programVersion: 5.0.2
elementType: H C C C C F C C H C O F F F C C C H H H H H C H O N H C C H C C H C H C H H C H H H
charge: 0
multiplicity: 1
keywords: wb97x-d3
keywords: def2-TZVPP
keywords: def2/J RIJCOSX
keywords: DEFGRID2
keywords: scfconv7
keywords: smallprint printgap noloewdin
keywords: NOSOSCF
formula: C18H17F4NO2
InChI: InChI=1/C18H17F4NO2/c1-2-16(17(24)23-11-12-6-4-3-5-7-12)25-13-8-9-15(19)14(10-13)18(20,21)22/h3-10,16,23H,2,11H2,1H3
42 atoms
H  0.352212 -2.329225 -1.175106
C  0.485199 -1.656206 -0.33904
C  1.751329 -1.223268 0.024133
C  2.967191 -1.644224 -0.749001
C  1.874686 -0.353008 1.097789
F  3.079352 0.110901 1.44096
C  0.772603 0.062729 1.80729
C  -0.490742 -0.372868 1.443153
H  -1.335477 -0.009668 2.010682
C  -0.640717 -1.227968 0.35748
O  -1.833136 -1.682534 -0.104638
F  3.519865 -0.608909 -1.394714
F  2.6730 -2.565147 -1.671152
F  3.908773 -2.164743 0.038161
C  -3.019865 -1.072879 0.371001
C  -4.202726 -1.792636 -0.260672
C  -4.306671 -3.253645 0.151159
H  -4.14473 -1.706341 -1.348884
H  -5.105093 -1.256972 0.04293
H  -3.442323 -3.829053 -0.175801
H  -5.194153 -3.710844 -0.285413
H  -4.385865 -3.354046 1.234493
C  -3.052401 0.425193 0.048709
H  -3.095913 -1.165346 1.461418
O  -3.542129 1.219579 0.822996
N  -2.534058 0.758239 -1.153943
H  2.471222 2.042789 -1.115475
C  1.53685 2.390767 -0.696037
C  0.340926 2.085058 -1.324642
H  0.356606 1.506781 -2.2421
C  -0.872694 2.516648 -0.796917
C  -0.867729 3.254073 0.381034
H  -1.807118 3.578631 0.810259
C  0.329269 3.567407 1.010041
H  0.319113 4.149521 1.922523
C  1.532946 3.136789 0.474288
H  2.466501 3.378473 0.9649
H  0.894087 0.749242 2.632968
C  -2.170319 2.128393 -1.460577
H  -2.047941 0.038511 -1.662999
H  -2.980974 2.783199 -1.144918
H  -2.091335 2.217427 -2.5451
totalener: -1300.90476025 hartree
nucrepener: 2382.01828907 hartree
electener: -3682.92304932 hartree
oneelecener: -6519.43567865 hartree
twoeener: 2836.51262933 hartree
kineticenergy: 1295.84611745 hartree
xcener: -118.332979397087 hartree
chargesum: -0.0000000
charge: 0.130750 -0.208046 -0.081648 0.533887 0.234873 -0.194382 -0.187862 -0.122799 0.119700 0.249211 -0.315503 -0.168636 -0.173246 -0.161934 0.141744 -0.121917 -0.255983 0.071747 0.089987 0.090682 0.088465 0.072820 0.215357 0.098178 -0.382638 -0.173137 0.136820 -0.109931 -0.197475 0.107608 0.060159 -0.118562 0.122559 -0.137962 0.128081 -0.150204 0.130875 0.126751 -0.056959 0.142815 0.108859 0.116894
qa: 0.1308 -0.2080 -0.0816 0.5339 0.2349 -0.1944 -0.1879 -0.1228 0.1197 0.2492 -0.3155 -0.1686 -0.1732 -0.1619 0.1417 -0.1219 -0.2560 0.0717 0.0900 0.0907 0.0885 0.0728 0.2154 0.0982 -0.3826 -0.1731 0.1368 -0.1099 -0.1975 0.1076 0.0602 -0.1186 0.1226 -0.1380 0.1281 -0.1502 0.1309 0.1268 -0.0570 0.1428 0.1089 0.1169
va: 1.0291 4.0248 3.6559 4.4440 4.0427 1.0999 3.9269 3.8575 1.0350 3.8580 2.0726 1.1244 1.1297 1.1457 3.7713 3.9057 3.9442 1.0176 1.0150 1.0097 1.0060 1.0046 4.1825 1.0121 2.1356 3.1342 1.0068 3.8860 3.9467 1.0125 3.5142 3.9427 1.0219 3.9157 0.9989 3.9034 1.0013 1.0091 3.8963 1.0419 1.0180 0.9988
dispcorr: -0.026024385 hartree
energy: -1300.930784639012
dipole: -39.41722 38.53263 -0.88459 8.05418 -8.19640 -0.14221 1.48252 -1.83669 -0.35418
magnitude: 0.96341 au
magnitude: 2.44880 debye
