program: Gaussian 09
title: 000057565
version: EM64L-G09RevD.01
frameworkgroup: C1[X(C9H15NO2)]
method: RPBEPBE
basis: SDD
operation: Freq
keyword: #p
keyword: freq=noraman
keyword: PBEPBE/SDD
title: #p freq=noraman PBEPBE/SDD
converged: YES YES NO NO
title: Mulliken charges:
elementType: O O N C C C C C C C C C H H H H H H H H H H H H H H H
charge: -0.259875 -0.250675 -0.091588 -0.157263 -0.469498 -0.504502 -0.289032 -0.412929 -0.419270 -0.396216 -0.511575 0.259505 0.250626 0.240402 0.228314 0.227048 0.245674 0.216295 0.240527 0.239950 0.214242 0.234832 0.218406 0.252724 0.184109 0.246327 0.263441
chargesum: 0.00000
title: Mulliken charges with hydrogens summed into heavy atoms:
elementType: O O N C C C C C C C C C
charge: -0.259875 -0.250675 -0.091588 0.093363 -0.000781 -0.031779 0.164205 0.043893 0.034922 0.040617 -0.001807 0.259505
polarizability: 1.44820812e+02 1.06678774e+00 9.92209214e+01 -9.13915608e-01 -7.97607714e-01 8.34389710e+01
1716.lowfreq: -23.0011 -17.3208 -7.5828 -0.0009 0.0001 0.0007 5.2458 32.3178 33.5361
frequency: -20.0585 31.0272 33.4638 56.8228 79.1171 107.5956 150.9470 176.1204 231.5423 261.2237 277.6435 359.8440 377.3009 415.3666 497.8101 558.9311 649.9374 727.1853 765.1150 785.4081 797.1267 810.9868 816.9611 825.4954 863.3352 895.8109 928.4430 937.7153 972.9713 989.8046 1007.0471 1038.4833 1055.3532 1062.3342 1064.7866 1078.3716 1085.9884 1103.4081 1121.7681 1131.4439 1145.5701 1156.3420 1164.3423 1189.4040 1214.2313 1233.8129 1259.0181 1274.5344 1300.5745 1330.6135 1377.6987 1403.3059 1440.7304 1443.1799 1453.9420 1466.0741 1467.6117 1473.9616 1478.7649 1632.3570 2898.6851 2999.9142 3004.3751 3047.3561 3050.8107 3062.0514 3064.1715 3068.0767 3096.0649 3105.9265 3133.0481 3163.6893 3181.0048 3194.0202 3213.5283
redmass: 2.7435 3.3975 5.0376 3.4687 3.1515 2.7686 2.9723 3.7375 3.5514 3.3807 4.5645 2.4458 2.1840 3.1643 3.5833 2.8165 5.7122 3.1216 1.1059 1.5550 2.0415 1.2853 1.8833 2.4739 6.1554 1.6676 4.3317 2.2046 1.2077 2.0112 2.5021 1.2213 1.7157 1.3348 1.2626 1.4019 2.6657 1.1829 1.6680 2.1741 1.7612 1.5554 1.4572 1.3471 1.5350 1.3298 2.4922 1.3544 1.4405 1.3734 1.5425 1.8247 1.0829 1.0863 1.0859 1.1730 1.1158 1.2672 1.1402 9.8035 1.0705 1.0577 1.0607 1.0922 1.0517 1.0617 1.1066 1.0967 1.0518 1.0621 1.0920 1.1140 1.1151 1.1170 1.1146
irintensity: 1.2661 0.6938 0.8348 0.1484 1.2406 0.7434 4.7495 6.3004 4.0726 1.9725 10.3920 7.0905 2.0929 2.2142 5.1764 2.1295 7.0016 6.4410 1.7160 7.6028 5.6673 1.8050 7.5204 6.7911 17.0947 8.3900 18.3239 82.3589 26.7991 64.1925 35.0901 21.9484 18.9260 11.8016 8.6848 27.2669 15.6788 1.7296 29.0378 246.5978 75.1386 1.2260 0.2995 2.3771 0.4404 1.4443 5.7781 37.8592 71.0196 3.6266 70.9600 3.9616 20.5260 10.9908 8.9534 5.1012 0.8671 4.8055 9.8649 177.8304 64.5472 17.5098 11.2382 1.7873 28.4619 34.0088 17.8793 28.6205 22.3133 11.3724 10.7811 1.8926 43.3279 0.4115 31.1433
temp: 298.150 k
press: 1.00000 atm
elementType: 8 8 7 6 6 6 6 6 6 6 6 6 1 1 1 1 1 1 1 1 1 1 1 1 1 1 1
symmnumber: 1
zpe: 594058.5 jmol-1
zpe.correction: 0.226265 hartree
zpe.thermalcorrener: 0.238710 hartree
zpe.thermalcorrenthalpy: 0.239655 hartree
zpe.thermalcorrgfe: 0.185357 hartree
zpe.sumelectzpe: -556.115422 hartree
zpe.sumelectthermal: -556.102977 hartree
zpe.sumelectthermalent: -556.102033 hartree
zpe.sumelectthermalfe: -556.156330 hartree
dipole: -0.7342 -1.0622 1.4631
dipole: 1.9514
quadrupole: -60.0700 -77.2636 -71.8461
quadrupole: 0.9460 3.0951 -1.7218
quadrupole: 9.6565 -7.5370 -2.1196 0.9460 3.0951 -1.7218
hfenergy: -556.3416872 hartree
pointgroup: C01 [X(C9H15N1O2)]
dipole: 0.2869169 -0.1727538 -0.6908472 debye
polarizability: 144.7990058|-1.2186237|96.4298174|-1.1688476|6.1068951|86.251881 unknown
InChI: InChI=1S/C9H15NO2/c11-9(3-4-10-5-6-10)12-7-8-1-2-8/h8H,1-7H2
charge 0 multiplicity 1
27 atoms
O  1.169955 -0.107168 -0.148808
O  0.066951 1.70856 0.809535
N  -3.635087 -0.527088 0.405586
C  3.553822 -0.238196 -0.571989
C  4.187193 -1.313091 0.321395
C  4.986332 -0.052052 -0.038175
C  2.4628 0.646627 -0.028101
C  -4.993365 0.071485 0.145291
C  -4.284508 -0.718722 -0.945572
C  -2.501912 0.438253 0.445166
C  -1.195822 -0.323777 0.168969
C  0.033323 0.553645 0.320904
H  3.452597 -0.479904 -1.635231
H  4.474365 -2.260773 -0.14184
H  3.809874 -1.408576 1.34405
H  5.150162 0.692699 0.747333
H  5.812856 -0.141812 -0.748084
H  -5.063194 1.159988 0.009173
H  -5.820068 -0.378942 0.702987
H  -4.596387 -1.741702 -1.177314
H  -3.886123 -0.1479 -1.79698
H  2.35952 1.589536 -0.596031
H  2.621583 0.900716 1.036655
H  -2.466051 0.882819 1.455238
H  -2.615802 1.277653 -0.282528
H  -1.197369 -0.775018 -0.840205
H  -1.114046 -1.169659 0.878576
