program: Gaussian 09
title: 000057556
version: EM64L-G09RevD.01
frameworkgroup: C1[X(C9H18N2O)]
method: RPBEPBE
basis: SDD
operation: Freq
keyword: #p
keyword: freq=noraman
keyword: PBEPBE/SDD
title: #p freq=noraman PBEPBE/SDD
converged: YES YES NO NO
title: Mulliken charges:
elementType: O N N C C C C C C C C C H H H H H H H H H H H H H H H H H H
charge: -0.295636 -0.093898 -0.132159 -0.411606 -0.425386 -0.416731 -0.513001 0.248939 -0.375101 -0.348301 -0.648868 -0.661868 0.216838 0.237624 0.236014 0.213305 0.189609 0.256128 0.247494 0.227803 0.220595 0.238799 0.200217 0.258762 0.219299 0.218368 0.222302 0.202944 0.215341 0.252175
chargesum: 0.00000
title: Mulliken charges with hydrogens summed into heavy atoms:
elementType: O N N C C C C C C C C C
charge: -0.295636 -0.093898 -0.132159 0.042856 0.023933 0.029005 -0.037705 0.248939 0.084293 0.110679 0.011101 0.008593
polarizability: 1.39797783e+02 -3.18961300e+00 1.15490274e+02 -9.85038374e-01 2.81275081e+00 8.72747977e+01
1716.lowfreq: -14.8503 -0.0007 -0.0005 -0.0001 2.6862 8.3103 35.1259 38.2247 57.2561
frequency: 34.9871 38.1759 56.9618 72.8321 91.4053 109.5451 129.1784 158.2673 202.5000 221.9638 257.2600 265.8234 313.0827 357.4870 373.3082 420.2203 463.5969 512.0215 571.3786 593.2249 695.8980 760.0632 777.0886 785.9921 792.0423 824.1939 832.1830 907.4637 941.2137 971.5440 986.2267 1019.6875 1048.3904 1061.2449 1070.5809 1077.1571 1078.7771 1087.0938 1097.0394 1118.6712 1137.2438 1147.9301 1189.5501 1215.2460 1243.6584 1258.8880 1275.6417 1293.6576 1304.3831 1342.4140 1358.0870 1363.3266 1383.9480 1388.2614 1417.1964 1444.9163 1452.1896 1457.5284 1465.9506 1466.7537 1468.5349 1476.3739 1477.4627 1482.8913 1493.6489 1579.4273 2913.4732 2980.3408 2982.4486 2982.8702 2996.8388 3003.8727 3031.1388 3048.4235 3060.7765 3061.4792 3066.1860 3070.3715 3082.3997 3083.3282 3090.2406 3101.5783 3160.4436 3178.3141
redmass: 2.8181 3.2978 3.0083 3.0312 3.2045 3.6688 2.6106 2.2683 1.1259 1.2051 3.8008 2.1108 2.7191 2.9442 2.2356 2.7134 3.1873 3.0044 3.2365 3.2476 3.6674 2.1946 1.1519 1.6985 1.2934 1.3747 2.7730 2.3887 2.1681 1.1807 1.9956 2.7340 1.7887 1.2869 2.0852 1.3919 1.7754 2.5654 1.7663 1.6301 1.5240 1.8484 1.3348 2.8486 1.5905 2.7345 1.3074 1.2512 1.3758 1.2575 1.2919 1.4460 1.2191 1.2121 2.4603 1.1021 1.0938 1.1213 1.0627 1.0876 1.0432 1.1514 1.0619 1.0575 1.1112 6.2378 1.0705 1.0594 1.0361 1.0356 1.0653 1.0636 1.0976 1.0518 1.0609 1.0970 1.0993 1.0928 1.0990 1.0988 1.1016 1.1018 1.1142 1.1153
irintensity: 1.4162 1.6389 1.6871 0.8615 0.5893 3.9054 2.9501 3.8039 0.2684 1.5274 0.5223 0.1320 1.3638 14.5098 2.3940 2.7285 8.8623 4.2319 7.2055 5.1530 7.1040 2.1154 2.8402 14.2581 10.5037 3.6329 10.0633 4.2495 7.5279 4.5020 33.8241 8.7111 6.4792 5.2758 14.2811 9.5408 12.3436 4.2221 18.0433 4.6483 21.7452 22.2270 1.5976 27.4858 54.1987 6.8113 31.1925 2.7736 33.8511 8.0644 8.8123 19.7958 14.6014 28.2002 122.3753 22.9463 13.8907 19.1665 2.7041 3.5285 15.3021 8.8258 9.1754 11.5808 10.1090 246.4779 50.9393 19.7873 26.3715 22.5291 38.4193 38.9798 6.7798 30.6456 36.6999 1.4353 10.6525 25.1215 42.2822 44.6022 44.8925 31.2203 2.6113 45.3515
temp: 298.150 k
press: 1.00000 atm
elementType: 8 7 7 6 6 6 6 6 6 6 6 6 1 1 1 1 1 1 1 1 1 1 1 1 1 1 1 1 1 1
symmnumber: 1
zpe: 685791.6 jmol-1
zpe.correction: 0.261204 hartree
zpe.thermalcorrener: 0.275636 hartree
zpe.thermalcorrenthalpy: 0.276580 hartree
zpe.thermalcorrgfe: 0.218493 hartree
zpe.sumelectzpe: -537.455150 hartree
zpe.sumelectthermal: -537.440718 hartree
zpe.sumelectthermalent: -537.439774 hartree
zpe.sumelectthermalfe: -537.497861 hartree
dipole: -1.3105 3.4116 -0.0432
dipole: 3.6549
quadrupole: -64.9667 -77.3447 -76.7669
quadrupole: -3.1209 -4.6028 -1.7117
quadrupole: 8.0594 -4.3185 -3.7408 -3.1209 -4.6028 -1.7117
hfenergy: -537.7163544 hartree
pointgroup: C01 [X(C9H18N2O1)]
dipole: 0.519604 1.3356201 0.1174909 debye
polarizability: 139.8115474|3.1865465|115.7355365|-0.8777476|-0.6512365|87.0157705 unknown
InChI: InChI=1S/C9H18N2O/c1-3-11(4-2)9(12)5-6-10-7-8-10/h3-8H2,1-2H3
charge 0 multiplicity 1
30 atoms
O  0.618051 -1.824513 0.524256
N  -3.082423 -0.04987 -0.636639
N  1.834983 0.083497 -0.00013
C  -4.405173 -0.443578 -0.032503
C  -3.769615 0.892911 0.323904
C  -1.890281 -0.762848 -0.093874
C  -0.637603 0.078944 -0.38548
C  0.641904 -0.628448 0.08214
C  1.948689 1.467598 -0.508209
C  3.084678 -0.586496 0.437633
C  1.920457 2.534223 0.610934
C  3.784515 -1.340645 -0.713235
H  -4.408495 -1.218534 0.747048
H  -5.248152 -0.484195 -0.729199
H  -4.151392 1.820245 -0.11469
H  -3.353358 0.991649 1.337205
H  -1.962749 -0.97101 0.999541
H  -1.810184 -1.737764 -0.604105
H  -0.593082 0.262391 -1.477538
H  -0.733324 1.073002 0.093657
H  2.899458 1.545004 -1.070129
H  1.141232 1.662094 -1.233991
H  3.755846 0.182763 0.864411
H  2.817768 -1.298902 1.236261
H  2.731307 2.364915 1.342225
H  2.050011 3.546029 0.184174
H  0.96097 2.509683 1.157508
H  4.032417 -0.663118 -1.551416
H  4.724416 -1.800975 -0.356538
H  3.128129 -2.142252 -1.091922
