program: Gaussian 09
title: 000057507
version: EM64L-G09RevD.01
frameworkgroup: C1[X(C7H11NO)]
method: RPBEPBE
basis: SDD
operation: Freq
keyword: #p
keyword: freq=noraman
keyword: PBEPBE/SDD
title: #p freq=noraman PBEPBE/SDD
converged: NO YES NO NO
title: Mulliken charges:
elementType: O N C C C C C C C H H H H H H H H H H H
charge: -0.249310 -0.291673 -0.462460 -0.311757 0.362330 -0.689271 -0.420294 -0.259006 -0.173904 0.229745 0.198245 0.206440 0.179487 0.266705 0.205208 0.233695 0.211000 0.258040 0.250915 0.255865
chargesum: 0.00000
title: Mulliken charges with hydrogens summed into heavy atoms:
elementType: O N C C C C C C C
charge: -0.249310 -0.024968 -0.034470 0.074171 0.362330 -0.039369 -0.162254 -0.008091 0.081961
polarizability: 1.09399151e+02 2.80341410e+00 7.92463924e+01 7.87790404e+00 -3.80793499e+00 5.85589734e+01
1716.lowfreq: -6.4603 -0.0006 -0.0005 -0.0003 2.9075 15.1655 39.2219 76.5327 84.0588
frequency: 39.0717 76.5251 84.0489 116.8976 223.7639 242.3403 309.1008 329.7539 440.4516 593.7894 619.5762 670.8200 719.1896 723.8518 811.8982 815.1865 868.6775 872.3089 875.5231 915.1091 955.3834 1011.7319 1029.8454 1046.1996 1109.0262 1126.3851 1131.1503 1141.1505 1199.9529 1217.3449 1238.7657 1264.5706 1319.5274 1358.3328 1377.6139 1391.4804 1447.3120 1468.9887 1474.4713 1481.5023 1494.1140 1498.7828 1604.2310 2840.2327 2847.8943 2980.3309 2992.9180 3020.2106 3072.6525 3093.9056 3218.4002 3233.4567 3266.6854 3437.4728
redmass: 3.5687 1.8147 3.9227 2.7058 3.6578 1.1392 2.6530 4.0576 3.1075 3.1424 3.1652 1.5024 1.7284 2.2748 1.0989 1.2782 4.0457 1.9584 2.5084 1.6026 1.8354 1.6298 2.7989 2.7874 2.2750 1.6378 1.5230 2.8606 2.1173 2.0631 1.2939 1.1640 1.2967 2.4137 1.3994 1.2836 1.1385 1.0639 1.1097 1.0455 4.6685 1.0942 7.1462 1.0720 1.0717 1.0379 1.0854 1.0861 1.0981 1.1002 1.0919 1.0990 1.1086 1.0745
irintensity: 0.9663 3.5294 1.2765 1.8958 0.6645 1.1391 3.1290 1.3534 0.5699 9.1016 23.2032 86.5831 53.7300 42.2866 6.7153 31.6729 12.4861 0.8542 11.9712 4.6237 2.7509 21.1158 6.5786 2.3497 9.6998 45.2842 15.3990 34.7204 3.1661 6.5102 7.9660 2.9814 29.1292 0.2284 4.8401 17.2146 41.9696 12.5699 8.2639 3.5726 8.2691 5.7417 6.4800 37.5145 192.7544 29.1311 38.1146 25.3422 55.8491 37.2779 4.7724 0.5265 0.8188 0.1875
temp: 298.150 k
press: 1.00000 atm
elementType: 8 7 6 6 6 6 6 6 6 1 1 1 1 1 1 1 1 1 1 1
symmnumber: 1
zpe: 441062.6 jmol-1
zpe.correction: 0.167992 hartree
zpe.thermalcorrener: 0.177407 hartree
zpe.thermalcorrenthalpy: 0.178352 hartree
zpe.thermalcorrgfe: 0.132359 hartree
zpe.sumelectzpe: -402.576716 hartree
zpe.sumelectthermal: -402.567300 hartree
zpe.sumelectthermalent: -402.566356 hartree
zpe.sumelectthermalfe: -402.612349 hartree
dipole: -0.0993 0.2340 0.5991
dipole: 0.6508
quadrupole: -47.4223 -50.3402 -58.1844
quadrupole: 0.7888 3.4992 -0.1286
quadrupole: 4.5600 1.6421 -6.2021 0.7888 3.4992 -0.1286
hfenergy: -402.7447075 hartree
pointgroup: C01 [X(C7H11N1O1)]
dipole: 0.0388582 -0.0934203 0.2351973 debye
dipolederiv: -0.5075486 0.1111545 0.1759679 0.0618446 -0.4870691 -0.1273728 0.1813896 -0.1571337 -0.2356209 -0.8335444 0.0593955 0.0338321 0.0317665 -0.2185274 0.0554521 0.0345298 0.1092833 -0.6247401 0.4450288 -0.1117852 0.093635 -0.1965905 0.2938751 -0.0978049 0.1298783 -0.0457139 0.4999559 0.6089665 0.0334131 -0.1402818 0.2097039 0.2147231 0.0695946 -0.1641631 0.0573202 0.4155793 0.2508589 0.0024957 -0.122627 0.0216392 0.3123036 0.1427306 -0.1367058 0.1462229 0.0239238 -0.0997456 0.0510824 -0.0504498 0.0537648 0.0614325 0.0297822 -0.0165895 0.0431848 0.0241389 -0.1894227 0.0570525 0.006401 0.0628234 -0.0299896 0.0381589 -0.0053395 0.0527804 -0.1884034 -0.0195689 0.0460982 -0.0650473 0.068949 -0.0797127 0.0051358 -0.0446422 0.025753 -0.1868249 0.1848023 -0.0671008 -0.1637924 -0.1527406 0.0799764 0.1268968 -0.1767884 0.0977192 -0.059334 0.0321239 -0.0176925 -0.0068847 0.0183831 -0.1423976 0.0017544 -0.0298608 -0.0519366 0.0619235 -0.1018354 -0.0056038 0.0561929 0.0594792 0.0425412 -0.0418017 -0.0713982 0.0461823 -0.2775572 0.0057849 -0.0008934 0.0053587 -0.0819145 -0.1965736 -0.0044907 0.0143341 -0.0282621 0.0538727 -0.1048212 0.0116829 0.0050675 0.0073173 0.0377489 -0.0467215 0.1564586 -0.023539 -0.3102592 0.1474105 -0.0082916 -0.0280888 -0.040849 -0.0065396 0.0157704 -0.0228659 -0.0955208 0.2705403 0.0810387 -0.0769869 -0.0167441 -0.0140922 -0.177343 -0.0145494 -0.0327092 -0.0406134 0.0761286 0.1161119 0.0104129 0.0379717 0.0111968 0.0754533 -0.0474812 -0.027688 -0.0240488 -0.151737 -0.2000265 -0.0198468 0.0490583 -0.0358447 0.0842234 0.026714 0.0757471 0.0222818 0.0761543 0.1358526 -0.0354154 0.0143993 -0.0298855 -0.0187615 -0.0618239 0.0169555 -0.0620985 0.1686898 -0.0307855 0.0003198 0.080795 0.0047478 0.1337589 -0.0256646 0.0895469 -0.0210948 0.1656092 0.07932 -0.0394909 0.0352365 -0.0596987 0.0208779 -0.0442791 0.0299107 -0.0507662 0.1979604 unknown
polarizability: 109.4143911|2.957522|79.2188369|-7.754068|3.9170192|58.5712889 unknown
InChI: InChI=1S/C7H11NO/c1-2-8-6-7-4-3-5-9-7/h3-5,8H,2,6H2,1H3
charge 0 multiplicity 1
20 atoms
O  1.169203 0.931628 0.511983
N  -1.622244 -0.038334 -0.175819
C  -0.600777 -0.789794 0.595565
C  -3.00858 -0.283174 0.278046
C  0.792063 -0.402941 0.208436
C  -4.004568 0.564479 -0.53079
C  1.861673 -1.048057 -0.386956
C  2.956558 -0.09888 -0.467146
C  2.500978 1.086343 0.07984
H  -0.72555 -1.87014 0.393019
H  -0.723886 -0.653431 1.701475
H  -3.2321 -1.358797 0.130539
H  -3.143729 -0.078581 1.371872
H  -1.399939 0.967499 -0.191921
H  -3.816665 1.645835 -0.385994
H  -3.910665 0.342288 -1.607958
H  -5.043084 0.358412 -0.215097
H  1.86675 -2.078264 -0.737463
H  3.94691 -0.278254 -0.88086
H  2.936653 2.068662 0.239031
