program: Gaussian 09
title: 000057604
version: EM64L-G09RevD.01
frameworkgroup: C1[X(C20H21NO4)]
method: RPBEPBE
basis: SDD
operation: Freq
keyword: #p
keyword: freq=noraman
keyword: PBEPBE/SDD
title: #p freq=noraman PBEPBE/SDD
converged: NO YES NO NO
title: Mulliken charges:
elementType: O O O O N C C C C C C C C C C C C C C C C C C C C H H H H H H H H H H H H H H H H H H H H H
charge: -0.284682 -0.242423 -0.243240 -0.230073 -0.113260 -0.405437 -0.066411 -0.336375 -0.347993 -0.326280 -0.320008 -0.315814 0.244821 0.220556 -0.522336 -0.381694 0.335530 -0.374308 -0.007281 0.293851 -0.367067 -0.363933 -0.238910 -0.232373 -0.231495 0.213865 0.224336 0.249691 0.201433 0.208503 0.213484 0.199435 0.256845 0.214543 0.193064 0.220066 0.218410 0.192464 0.289554 0.254760 0.276219 0.265933 0.270939 0.230040 0.231412 0.231638
chargesum: 0.00000
title: Mulliken charges with hydrogens summed into heavy atoms:
elementType: O O O O N C C C C C C C C C C C C C C C C C C C C
charge: -0.284682 -0.242423 -0.243240 -0.230073 -0.113260 0.032764 0.183280 0.073561 0.064926 0.145108 0.093122 0.095060 0.244821 0.220556 -0.232782 -0.126933 0.335530 -0.098088 -0.007281 0.293851 -0.101134 -0.092994 -0.008871 -0.000961 0.000144
polarizability: 3.34713831e+02 2.70196994e+01 2.37393835e+02 -3.21401159e+01 1.16915836e+01 1.64778442e+02
1716.lowfreq: -11.1684 -2.8261 -0.0008 -0.0005 0.0002 5.3046 11.3360 26.8024 32.6111
frequency: -0.5254 26.3419 32.5089 48.2193 51.1047 64.0719 97.3966 116.1710 133.3897 150.6457 164.1982 205.5618 228.3963 240.6057 253.3172 255.3763 295.0390 325.3745 331.9152 356.1598 386.9898 395.3609 407.1379 424.1246 435.6424 449.9305 458.0185 471.7348 493.3954 521.4422 542.6927 580.6045 596.5433 614.7945 615.2084 664.4828 694.3602 700.6086 709.8102 725.8598 737.8022 768.7731 799.1010 809.1884 835.6989 840.7608 846.3663 855.7566 861.2083 891.1931 909.4496 913.4787 944.3504 959.5185 969.3159 979.3281 988.7061 989.2684 1001.4408 1003.4693 1026.3753 1026.8771 1045.7279 1053.1249 1059.6977 1081.5322 1085.8980 1091.1973 1106.8018 1128.1817 1133.8804 1140.2995 1158.2814 1173.6015 1176.3912 1187.3569 1190.3464 1203.5699 1227.2718 1236.9412 1259.8667 1264.2842 1278.4371 1289.8215 1293.8746 1306.9602 1314.7677 1317.6201 1331.4833 1346.1219 1355.1158 1366.4259 1373.4978 1378.2647 1381.8504 1389.3105 1423.0159 1432.5783 1444.2275 1448.8836 1450.8718 1460.2812 1460.7739 1474.1491 1475.3600 1488.9292 1526.2002 1573.5988 1587.6380 1606.7014 1613.3683 2872.5344 2879.0777 2901.9998 2951.0947 2956.5063 2985.7210 2999.3332 3025.4689 3032.6513 3034.8589 3082.1704 3085.6306 3119.3616 3126.1621 3136.2326 3147.9076 3154.9813 3157.3551 3163.6223 3167.9026 3174.8556
redmass: 3.7064 6.4667 4.1335 4.8969 4.8157 4.7521 5.5859 4.7938 4.9324 4.5380 4.8877 4.5522 4.2751 2.9767 3.2521 4.0689 3.1135 6.9573 2.2042 7.4444 4.6327 1.9377 2.8900 3.9273 3.5103 4.0724 3.3943 2.8206 5.8933 5.9544 5.5215 4.3107 3.0648 6.3778 3.1549 4.9019 3.5866 5.2442 1.8606 4.7151 3.0410 4.0036 2.2459 3.8541 2.6428 1.6340 2.0938 2.3653 1.2725 2.8578 1.8727 1.7670 1.4755 3.2897 1.3696 4.9601 2.3176 2.1972 2.6511 1.3334 2.1923 2.1620 2.4476 2.2967 2.1222 1.8255 2.4955 3.1228 2.4247 2.3726 1.9217 2.1148 2.4719 1.0648 2.1028 1.1291 1.0758 1.2335 1.5893 1.7598 1.5517 1.3282 1.3676 2.0607 1.2812 1.5087 1.3748 1.4463 1.2788 1.2599 1.4616 1.5561 1.2772 4.8221 8.4280 1.5649 4.4643 2.2697 1.0820 1.0792 1.0966 1.0960 1.1239 1.1058 2.1729 3.0406 10.2407 7.7935 6.5946 6.0778 7.0442 1.0702 1.0689 1.0684 1.0669 1.0668 1.0777 1.0732 1.0910 1.0906 1.0903 1.0959 1.0976 1.0991 1.0849 1.0882 1.0926 1.0879 1.0960 1.0917 1.1008 1.0971
irintensity: 0.1798 0.9409 0.3402 1.4263 0.4156 0.3957 0.8610 6.8664 1.0519 5.6575 1.7249 2.5658 5.8265 0.4939 1.7454 0.9288 11.9446 2.1601 5.0136 4.2518 1.7090 0.5449 0.0991 6.8509 6.2316 11.4592 3.3188 0.9060 1.2382 2.4364 2.5186 31.7906 8.6931 0.1158 3.2593 14.0825 0.8402 5.6257 97.5923 6.4302 45.0999 6.8520 8.6579 27.3289 11.7586 6.3653 13.4736 43.0918 3.6085 32.6637 30.1697 18.5935 1.7183 24.3100 10.7010 87.5854 4.4295 0.3387 39.9995 0.8230 11.7512 4.6208 43.7617 23.0654 10.7138 18.3843 45.6296 50.2330 8.1752 12.4925 6.7509 55.6110 6.7294 0.4248 10.9274 19.3717 2.1188 6.2866 25.8920 178.4998 140.1258 15.4310 23.3317 433.5703 13.5610 103.8264 29.7414 73.1223 0.2615 5.4515 1.6893 8.5055 3.7160 23.1904 1.6689 3.5572 2.3323 13.8136 3.1105 1.0042 19.1462 7.6569 7.5281 12.3168 13.2846 74.8732 265.5505 38.7510 4.3470 29.6888 42.4477 44.9530 79.2619 78.0023 35.2783 91.4510 32.8650 28.9693 18.5196 46.1531 56.1275 38.2946 32.9595 11.6846 0.2726 6.2552 22.2854 1.0349 18.1851 1.9583 23.7779 4.7196
temp: 298.150 k
press: 1.00000 atm
elementType: 8 8 8 8 7 6 6 6 6 6 6 6 6 6 6 6 6 6 6 6 6 6 6 6 6 1 1 1 1 1 1 1 1 1 1 1 1 1 1 1 1 1 1 1 1 1
symmnumber: 1
zpe: 972395.1 jmol-1
zpe.correction: 0.370366 hartree
zpe.thermalcorrener: 0.390847 hartree
zpe.thermalcorrenthalpy: 0.391791 hartree
zpe.thermalcorrgfe: 0.320016 hartree
zpe.sumelectzpe: -1128.509066 hartree
zpe.sumelectthermal: -1128.488586 hartree
zpe.sumelectthermalent: -1128.487641 hartree
zpe.sumelectthermalfe: -1128.559416 hartree
dipole: 3.2128 -3.0558 -2.0229
dipole: 4.8736
quadrupole: -163.9598 -145.4941 -140.7490
quadrupole: 19.3286 -3.6037 1.3489
quadrupole: -13.8922 4.5735 9.3186 19.3286 -3.6037 1.3489
hfenergy: -1128.8794321 hartree
pointgroup: C01 [X(C20H21N1O4)]
dipole: 1.2188254 1.4249484 0.4006594 debye
polarizability: 336.0438932|-13.1056071|236.6860276|38.2490139|-9.436352|164.156187 unknown
InChI: InChI=1S/C20H21NO4/c22-20(15-4-2-1-3-5-15)16-6-7-18-19(12-16)25-17(14-24-18)13-21-8-10-23-11-9-21/h1-7,12,17H,8-11,13-14H2
charge 0 multiplicity 1
46 atoms
O  0.822874 0.313582 0.147871
O  7.27089 0.935179 -0.972124
O  1.548612 -2.172158 1.507476
O  -4.620008 -2.273046 -0.277371
N  4.536751 0.718013 -0.009641
C  3.109396 1.080615 0.1468
C  2.22672 -0.173247 0.215963
C  4.895689 0.359932 -1.4101
C  5.45446 1.774179 0.496531
C  2.421245 -0.974584 1.507328
C  6.359684 -0.10606 -1.47252
C  6.90904 1.283374 0.411038
C  -0.133369 -0.680605 0.462436
C  0.229719 -1.900346 1.103581
C  -1.473576 -0.440125 0.112664
C  -0.752575 -2.887827 1.340333
C  -2.468384 -1.419563 0.370076
C  -2.085293 -2.655115 0.967699
C  -3.899497 -1.249008 -0.040128
C  -4.497759 0.125554 -0.182469
C  -4.095807 1.226264 0.62186
C  -5.566416 0.296518 -1.10393
C  -4.74341 2.475609 0.495723
C  -6.200174 1.547605 -1.241386
C  -5.789104 2.642426 -0.441795
H  2.988117 1.649641 1.088283
H  2.729061 1.729339 -0.678291
H  2.398644 -0.839632 -0.653284
H  4.75595 1.233563 -2.095029
H  4.240845 -0.456949 -1.765885
H  5.202497 1.994807 1.551273
H  5.354601 2.720956 -0.090607
H  3.451909 -1.351537 1.582843
H  2.173085 -0.349907 2.388445
H  6.480933 -1.032265 -0.869979
H  6.671478 -0.295296 -2.512827
H  7.614338 2.076378 0.709582
H  7.042115 0.395883 1.067621
H  -1.714596 0.495209 -0.401001
H  -0.445846 -3.820244 1.823938
H  -2.856416 -3.414323 1.128475
H  -3.303286 1.096339 1.366411
H  -5.886008 -0.56964 -1.69279
H  -4.437099 3.31434 1.130762
H  -7.015009 1.672008 -1.963182
H  -6.285722 3.614163 -0.543271
