program: Gaussian 09
title: 000057538
version: EM64L-G09RevD.01
frameworkgroup: C1[X(C6H11Cl3N2O)]
method: RPBEPBE
basis: SDD
operation: Freq
keyword: #p
keyword: freq=noraman
keyword: PBEPBE/SDD
title: #p freq=noraman PBEPBE/SDD
converged: YES YES NO NO
title: Mulliken charges:
elementType: Cl Cl Cl O N N C C C C C C H H H H H H H H H H H
charge: -0.071662 -0.071572 -0.061992 -0.256469 -0.076415 -0.362479 -0.321051 -0.316464 -0.563325 -0.554279 0.311070 -0.654632 0.244441 0.233229 0.230882 0.243740 0.329485 0.305681 0.255997 0.262105 0.291115 0.301046 0.301547
chargesum: 0.00000
title: Mulliken charges with hydrogens summed into heavy atoms:
elementType: Cl Cl Cl O N N C C C C C C
charge: -0.071662 -0.071572 -0.061992 -0.256469 -0.076415 -0.032994 0.156619 0.158158 -0.001647 -0.001058 0.311070 -0.052038
polarizability: 1.24869465e+02 5.61288272e-01 1.19898174e+02 -3.55711024e+00 -8.00311419e-01 9.18393747e+01
1716.lowfreq: -11.9237 -4.6496 -3.6231 0.0020 0.0021 0.0025 12.1163 35.5234 44.1815
frequency: 3.2272 35.4861 44.1397 62.3724 66.9250 79.7675 94.2970 121.2880 143.6444 194.6686 198.6733 244.0340 278.2616 350.5088 364.9020 407.0113 478.4921 584.5102 593.9593 656.0148 671.8517 673.9039 683.9954 758.9217 770.7833 865.7578 906.2637 924.3460 978.0695 1009.8962 1025.0877 1026.7508 1108.0653 1122.5965 1153.0681 1223.5894 1239.5531 1244.2697 1252.3656 1256.4770 1271.9634 1317.2244 1350.2997 1354.6555 1358.9923 1419.1961 1439.0003 1444.2443 1453.5896 1462.9112 1488.0353 1608.3315 2999.1913 3001.7675 3063.0490 3067.3868 3071.3048 3072.8732 3077.9773 3153.0152 3165.7172 3168.6135 3442.7745
redmass: 3.6700 5.2897 9.7521 3.8336 6.4071 2.2580 5.6779 3.0092 12.3670 6.4124 4.4948 5.3241 6.2036 7.1955 8.4965 3.3830 3.1433 3.7990 4.4280 1.1332 5.9622 5.4891 6.7043 1.1762 1.1827 4.6520 1.7498 6.2976 1.5563 1.6181 3.8844 3.6521 1.3789 1.9493 1.1168 2.0427 2.0635 1.1691 1.1937 1.2238 1.7279 1.4054 1.6504 1.2179 1.2256 1.0931 1.0790 1.0771 1.1001 1.1004 1.5329 8.1268 1.0597 1.0611 1.1000 1.0907 1.0567 1.0728 1.0591 1.1092 1.1108 1.1111 1.0782
irintensity: 0.2410 1.2932 2.0789 1.3703 0.2101 2.1481 7.4435 10.1985 4.0508 13.2698 1.5411 13.3923 2.3926 18.4003 3.1555 16.6848 2.4011 44.4061 10.6882 90.8153 80.9686 76.4632 40.1633 8.0247 9.3064 3.4144 7.0813 10.0784 4.7911 5.6999 0.1060 4.0921 29.8261 21.6019 0.0027 8.3535 16.3465 6.8789 11.7441 20.4833 13.4242 10.1552 12.4732 0.7569 2.3936 27.1006 10.1772 11.8349 6.2982 19.2411 100.3994 121.9744 11.5426 32.1811 2.8494 14.5069 2.3602 21.8198 12.4110 0.2844 10.9662 13.4737 33.7862
temp: 298.150 k
press: 1.00000 atm
elementType: 17 17 17 8 7 7 6 6 6 6 6 6 1 1 1 1 1 1 1 1 1 1 1
symmnumber: 1
zpe: 455477.6 jmol-1
zpe.correction: 0.173482 hartree
zpe.thermalcorrener: 0.188308 hartree
zpe.thermalcorrenthalpy: 0.189252 hartree
zpe.thermalcorrgfe: 0.125539 hartree
zpe.sumelectzpe: -1799.155882 hartree
zpe.sumelectthermal: -1799.141056 hartree
zpe.sumelectthermalent: -1799.140112 hartree
zpe.sumelectthermalfe: -1799.203825 hartree
dipole: 2.5869 -0.1367 -1.3713
dipole: 2.9311
quadrupole: -97.7268 -109.4203 -93.2022
quadrupole: -1.3689 4.7760 -0.1147
quadrupole: 2.3897 -9.3039 6.9142 -1.3689 4.7760 -0.1147
hfenergy: -1799.3293641 hartree
pointgroup: C01 [X(C6H11Cl3N2O1)]
dipole: 0.3199621 -0.4595892 1.0080876 debye
dipolederiv: -0.4169527 -0.2741918 0.1775299 -0.2635003 -0.498161 0.2068543 0.1216981 0.1409654 -0.2887859 -0.8055648 -0.0135822 -0.1573132 0.0004751 -0.1878645 -0.0010959 -0.079561 -0.0095926 -0.2101159 -0.1840851 0.0751045 -0.0643481 0.0658195 -0.2730268 0.0723989 -0.1491879 0.2487182 -0.6235847 -0.468149 0.103415 -0.1333892 0.1307832 -0.6550156 0.2038642 0.0333264 -0.1546628 -0.9340526 -0.4853104 -0.2271029 0.0241088 -0.2135082 -0.1564128 -0.0268243 0.0182067 -0.0688004 -0.5941252 -0.486309 -0.0295078 0.1590176 -0.0232011 -0.4809069 -0.2783782 0.1950909 -0.3105656 -0.2384732 0.2143971 0.261063 -0.1233824 0.2087427 0.3186693 -0.0271478 -0.2826691 -0.2038928 0.3613973 0.5798275 0.0094735 0.0337239 0.092788 0.047372 0.0904739 0.2424319 0.1237593 0.27283 0.4627734 0.3103735 -0.129717 0.3079825 0.4945192 -0.2609892 -0.051076 -0.1502154 0.1257937 0.8675855 0.0065911 0.1319511 -0.0268492 0.1501585 -0.0822738 -0.0035086 -0.0706851 0.0988898 0.3723192 -0.3335608 0.0854641 -0.3729366 0.9928686 -0.0348652 -0.161785 0.4821207 0.9346729 0.1156057 0.0820508 0.0160443 0.0917182 -0.0365656 0.0444959 0.1604677 -0.2493197 0.8012586 -0.0858608 -0.0321775 -0.0782811 -0.0110574 0.1029479 0.0235049 -0.0521388 0.0342281 -0.0083234 0.0371012 0.0823671 0.0469032 0.0582459 -0.1127568 -0.0353143 0.0552445 0.0241235 0.0495975 0.034449 0.0524701 -0.013278 0.0496089 -0.1139273 -0.0312475 -0.0594297 0.003481 0.0838507 -0.0166979 -0.0650964 0.0516264 -0.0925431 0.0582862 0.0769822 0.0401908 0.058181 -0.0621903 0.2747828 0.028485 -0.0054442 0.0412413 0.1918734 -0.0051592 0.0014133 -0.0170149 0.1833766 0.0188084 0.0135228 0.012159 0.0314037 -0.0032117 -0.0502062 0.0323342 0.0035011 0.0712377 -0.0919607 -0.0271806 -0.0916814 -0.0202825 0.0406122 0.0156051 -0.0534348 0.03185 0.0050166 -0.0294493 -0.0261952 0.0663064 -0.0329058 0.0397732 0.0717077 0.0306627 0.0607231 -0.0430334 0.0099902 0.0353402 0.0172785 0.0078369 -0.0560446 -0.0120376 -0.0220083 0.007576 0.0681564 0.0810779 -0.069763 -0.0305157 -0.0332959 0.0288217 0.0130548 -0.0480861 -0.0086271 -0.0233182 0.001622 0.0381015 0.0052373 0.0034342 0.1079916 0.0265976 0.0318182 0.0241489 -0.0300751 unknown
polarizability: 119.4582284|1.8119756|111.4823049|3.9432248|-16.2480928|105.6664804 unknown
InChI: InChI=1S/C6H11Cl3N2O/c7-1-3-11(4-2-8)10-6(12)5-9/h10H,1-5H2
charge 0 multiplicity 1
23 atoms
Cl 2.055804 3.188891 -1.610247
Cl -4.205569 0.279097 -0.762129
Cl 1.350694 -2.645688 2.910527
O  0.488239 -1.395287 -0.875216
N  -0.372524 0.801882 0.806367
N  0.206239 -0.403003 1.236068
C  0.519942 1.863466 0.307836
C  -1.830556 0.826501 0.601565
C  0.86163 1.774153 -1.195958
C  -2.312212 0.169113 -0.710483
C  0.603027 -1.418035 0.387406
C  1.235811 -2.6586 1.017629
H  1.457754 1.829646 0.891049
H  0.043036 2.840487 0.513251
H  -2.153813 1.883661 0.620122
H  -2.321386 0.319871 1.453544
H  0.350229 -0.527831 2.245973
H  1.375032 0.842508 -1.465284
H  -0.012155 1.933787 -1.844467
H  -1.959443 0.690814 -1.61102
H  -2.068691 -0.899417 -0.771757
H  0.642307 -3.546192 0.755193
H  2.267104 -2.771223 0.652633
