program: Gaussian 09
title: 000057519
version: EM64L-G09RevD.01
frameworkgroup: C1[X(C15H20ClN3O2)]
method: RPBEPBE
basis: SDD
operation: Freq
keyword: #p
keyword: freq=noraman
keyword: PBEPBE/SDD
title: #p freq=noraman PBEPBE/SDD
converged: NO YES NO NO
title: Mulliken charges:
elementType: Cl O O N N N C C C C C C C C C C C C C C C H H H H H H H H H H H H H H H H H H H H
charge: -0.081266 -0.285111 -0.271836 -0.069017 -0.426161 -0.685986 -0.096394 -0.465254 -0.030133 -0.454998 -0.457698 -0.470339 -0.473701 0.149449 0.177351 0.210047 -0.363640 -0.569334 -0.396608 0.678671 -0.530991 0.208839 0.217608 0.247568 0.263667 0.209968 0.215404 0.216251 0.211614 0.231184 0.234004 0.224737 0.236670 0.320318 0.269715 0.249526 0.320759 0.314668 0.225358 0.209082 0.286008
chargesum: 0.00000
title: Mulliken charges with hydrogens summed into heavy atoms:
elementType: Cl O O N N N C C C C C C C C C C C C C C C
charge: -0.081266 -0.285111 -0.271836 -0.069017 -0.105843 -0.050559 0.112445 -0.000077 0.233534 -0.029627 -0.029832 -0.005150 -0.012294 0.149449 0.177351 0.210047 -0.093925 -0.319807 -0.396608 0.678671 0.189458
polarizability: 2.69070757e+02 1.63729725e+01 2.19768851e+02 -1.41043656e+00 2.28833635e+00 1.24207249e+02
1716.lowfreq: -29.7993 -7.8469 -5.0006 0.0007 0.0017 0.0017 16.1530 23.5520 41.8846
frequency: -17.9187 23.3063 41.8532 69.3799 79.2532 92.9134 118.3869 137.8262 168.6926 186.3771 206.5234 232.1922 242.9420 253.7485 268.3859 290.5967 299.3816 310.4155 345.8012 353.1810 374.5186 398.7325 406.5407 423.9878 449.4434 476.2015 493.2199 519.3171 547.8611 571.5212 599.5452 600.8416 623.1401 628.1978 674.3158 713.7510 716.7167 746.0419 751.0566 770.1299 794.4891 809.4360 842.7288 853.6662 859.5513 876.3499 889.6238 922.3054 930.3600 937.2175 982.2294 983.9917 1016.7104 1022.8616 1036.6966 1048.5505 1057.6798 1069.4989 1100.1557 1115.7356 1119.5429 1142.0117 1148.0546 1160.0135 1188.1381 1194.3585 1199.8248 1231.5385 1245.6477 1252.8039 1259.3000 1273.6228 1298.5881 1299.5315 1305.9716 1310.8418 1316.4954 1321.4409 1338.5739 1341.0289 1352.9684 1378.9584 1412.8561 1441.5413 1448.9025 1453.4047 1456.2123 1458.8654 1464.4733 1467.6168 1477.4364 1480.3437 1504.9419 1540.6447 1574.0961 1618.1548 1643.7567 2961.6109 2975.0174 2982.5642 2983.4798 3003.1355 3008.8092 3011.4689 3033.3599 3039.6509 3041.2361 3068.4373 3075.0347 3085.1056 3085.5916 3124.3078 3154.7347 3157.9780 3514.2915 3553.7201 3700.9169
redmass: 3.9099 4.7235 4.9420 4.4497 4.5960 4.0494 3.4748 5.2729 4.5807 4.8050 1.8182 2.7085 3.3399 4.9187 2.3058 2.2644 3.9334 3.2726 9.6859 2.4363 3.3023 2.4287 1.4493 2.7343 2.1909 1.4230 4.4669 3.8539 4.1887 2.6680 7.5931 1.8036 3.0216 3.6539 7.5909 3.9291 5.7995 4.2806 4.6144 1.8148 2.1720 1.5268 2.0278 4.1185 1.9626 2.9709 1.3935 5.9196 3.4603 1.7319 2.5397 2.3544 2.7709 2.6047 2.9529 2.5522 2.5853 2.3262 1.7894 1.2588 1.4576 1.6001 1.2241 1.6685 1.4454 2.6000 1.4948 1.3248 1.5228 1.4516 1.5406 1.5235 3.1033 1.3584 1.3325 1.4000 1.4221 1.3314 1.4149 1.4437 1.3676 2.9864 4.4934 2.1874 1.3984 1.1660 1.0856 1.0997 1.0841 1.0856 1.0805 1.0877 4.2913 6.5268 7.0275 1.7175 2.5649 1.0850 1.0337 1.0598 1.0590 1.0608 1.0613 1.0638 1.0938 1.1001 1.1002 1.1060 1.1058 1.1020 1.0979 1.1056 1.0910 1.0918 1.0770 1.0454 1.1037
irintensity: 0.2117 0.5657 1.4786 1.7428 2.6311 4.9302 5.2085 2.3785 2.5647 2.6080 0.3565 1.8218 1.0131 5.8477 1.8674 15.7909 4.2569 7.7579 2.2763 2.7747 3.1714 9.7064 110.1418 6.9766 97.2812 67.9628 11.6880 1.6756 1.7213 44.4056 9.6547 62.1301 20.2469 11.2627 9.5485 9.1215 1.7507 13.8256 14.5044 5.4813 3.0580 23.1417 1.0937 13.1007 39.8433 1.2825 18.2397 14.4343 10.6209 9.3916 4.2722 14.2716 4.7503 16.1691 3.3088 24.9220 7.1068 9.9281 17.8986 0.3732 0.6154 32.2877 4.4590 7.3275 9.3528 171.4054 9.0802 49.1872 0.4237 96.8736 62.6108 7.8227 63.8883 8.7560 3.1471 40.2971 16.1092 31.2874 2.9802 15.6829 21.4450 58.4322 11.6770 454.9085 83.2944 16.0862 7.8992 31.0385 11.2453 25.7394 54.8498 4.8024 71.9925 53.4652 162.7149 9.4729 507.0967 26.9005 60.0781 48.0398 24.6326 81.1453 54.2735 23.0139 28.0929 28.7720 19.0275 20.7641 95.4496 28.4122 39.7573 16.6437 6.6790 0.5293 37.5693 111.1748 37.1218
temp: 298.150 k
press: 1.00000 atm
elementType: 17 8 8 7 7 7 6 6 6 6 6 6 6 6 6 6 6 6 6 6 6 1 1 1 1 1 1 1 1 1 1 1 1 1 1 1 1 1 1 1 1
symmnumber: 1
zpe: 879488.7 jmol-1
zpe.correction: 0.334980 hartree
zpe.thermalcorrener: 0.354000 hartree
zpe.thermalcorrenthalpy: 0.354945 hartree
zpe.thermalcorrgfe: 0.287539 hartree
zpe.sumelectzpe: -1356.765944 hartree
zpe.sumelectthermal: -1356.746923 hartree
zpe.sumelectthermalent: -1356.745979 hartree
zpe.sumelectthermalfe: -1356.813385 hartree
dipole: 0.3617 -1.0346 -1.8894
dipole: 2.1843
quadrupole: -97.7462 -131.7947 -138.0163
quadrupole: -0.3904 1.1615 -6.9727
quadrupole: 24.7728 -9.2756 -15.4972 -0.3904 1.1615 -6.9727
hfenergy: -1357.1009237 hartree
pointgroup: C01 [X(C15H20Cl1N3O2)]
dipole: 0.1788439 -0.4478906 -0.711261 debye
polarizability: 265.6509338|20.4264137|222.9354629|-3.2441754|-5.4263051|124.4604611 unknown
InChI: InChI=1S/C15H20ClN3O2/c1-21-13-8-12(17)11(16)7-10(13)15(20)18-14-6-9-2-4-19(14)5-3-9/h7-9,14,18H,2-6,17H2,1H3
charge 0 multiplicity 1
41 atoms
Cl -3.134326 -3.504436 0.223273
O  0.064722 1.89234 0.89857
O  -2.894115 2.503024 -0.260543
N  2.992808 -0.452418 -1.198867
N  0.799125 0.176576 -0.487674
N  -5.452517 -1.516655 0.084175
C  4.162751 -0.100155 1.09625
C  2.761859 0.575412 1.093518
C  2.225114 0.535722 -0.376313
C  5.035481 0.494569 -0.046219
C  3.972362 -1.618149 0.833922
C  4.364794 0.111161 -1.416428
C  3.113982 -1.762902 -0.472881
C  -0.20492 0.885449 0.160683
C  -1.590004 0.336942 -0.026605
C  -2.789882 1.119488 -0.113456
C  -1.747072 -1.079052 0.056225
C  -4.057193 0.492218 -0.073487
C  -3.003582 -1.678824 0.082433
C  -4.207117 -0.912103 0.036933
C  -1.791498 3.316886 -0.796304
H  4.654686 0.062685 2.072112
H  2.075896 0.029384 1.766704
H  2.805488 1.616683 1.45227
H  2.388373 1.526934 -0.848253
H  6.065117 0.094443 0.012819
H  5.102462 1.593566 0.067134
H  3.460202 -2.092622 1.6918
H  4.957223 -2.111056 0.722366
H  4.279995 0.988539 -2.082761
H  4.954095 -0.656265 -1.949185
H  3.55983 -2.490638 -1.173657
H  2.093574 -2.112299 -0.236276
H  0.568372 -0.417996 -1.289033
H  -0.855825 -1.705136 0.159968
H  -4.938978 1.135466 -0.157026
H  -5.522892 -2.529203 0.152761
H  -6.300789 -0.958875 0.07537
H  -2.276776 4.2406 -1.14756
H  -1.298797 2.804028 -1.645143
H  -1.047528 3.523069 -0.011215
