program: Gaussian 09
title: 000057449
version: EM64L-G09RevD.01
frameworkgroup: C1[X(C6H14N2O2)]
method: RPBEPBE
basis: SDD
operation: Freq
keyword: #p
keyword: freq=noraman
keyword: PBEPBE/SDD
title: #p freq=noraman PBEPBE/SDD
converged: NO YES NO NO
title: Mulliken charges:
elementType: O O N N C C C C C C H H H H H H H H H H H H H H
charge: -0.412275 -0.242458 -0.624103 -0.571393 -0.366810 -0.416656 -0.345475 -0.153185 -0.394033 0.153393 0.193695 0.208363 0.209398 0.229094 0.218637 0.177478 0.256510 0.178685 0.207898 0.310871 0.271484 0.258060 0.273290 0.379532
chargesum: 0.00000
title: Mulliken charges with hydrogens summed into heavy atoms:
elementType: O O N N C C C C C C
charge: -0.032743 -0.242458 -0.041748 -0.040043 0.035248 0.021835 0.050640 0.103325 -0.007450 0.153393
polarizability: 9.38037368e+01 -2.50254429e+00 8.05283982e+01 2.32930621e+00 -9.45197101e-01 8.02195043e+01
1716.lowfreq: -22.8036 0.0005 0.0007 0.0008 6.0754 9.4087 44.9737 45.9160 61.3364
frequency: 44.1095 45.2107 61.3016 89.6970 121.8842 133.3348 183.3993 222.3821 236.0045 274.9842 313.1404 345.9225 388.2581 450.7735 478.4686 524.9950 576.6474 598.9803 634.0129 718.5392 737.7030 781.8148 809.1258 889.8092 914.2977 976.8829 1029.3692 1049.2981 1054.1451 1073.1180 1092.1659 1116.3931 1153.5094 1183.0527 1212.5085 1225.7288 1262.9273 1266.3410 1284.7744 1291.5984 1294.3568 1335.2468 1360.8579 1385.7352 1388.1371 1458.6842 1463.5426 1476.7379 1492.9881 1603.5445 1639.0214 1665.8529 2862.3087 2954.4522 2961.8376 2968.8538 2982.0290 3005.0791 3009.7270 3036.9181 3051.9263 3453.9585 3496.6217 3516.2899 3581.6491 3639.1796
redmass: 2.4042 3.0895 6.1910 3.2390 3.1599 2.0629 3.2657 1.3946 1.1315 2.5153 2.6475 3.1861 2.7754 2.8156 1.6436 2.4164 2.5012 1.2973 1.7481 3.9081 1.1278 1.3221 2.8856 1.7309 1.9309 1.8251 2.5505 3.0188 1.9635 2.1263 2.2051 1.9340 1.2898 2.0890 1.4992 1.4803 1.3654 1.4981 1.0535 1.3312 1.1469 1.3302 1.5220 1.5573 1.7286 1.0970 1.0707 1.0939 1.0902 1.3011 1.0943 3.8507 1.0716 1.0636 1.0614 1.0687 1.0764 1.0908 1.0911 1.1001 1.1022 1.0448 1.0449 1.0640 1.0975 1.1001
irintensity: 3.4502 2.0061 0.2036 1.5284 0.6770 1.2798 0.4458 22.7190 95.0168 2.7392 4.3683 0.5845 19.5702 144.0815 221.7143 3.9614 67.0786 205.0677 150.9704 22.5126 13.9824 1.4060 0.7063 1.4618 0.6849 2.5873 5.4839 149.7527 130.5527 15.5259 4.2218 20.3020 9.0633 5.3113 3.5178 1.2261 1.7063 7.6961 1.1899 11.7897 4.2531 0.9810 1.5110 17.6337 10.2110 2.4802 0.9090 7.8574 5.0770 141.6011 39.2732 137.9024 112.1523 9.7953 19.4697 35.8341 60.5402 26.3131 12.2393 6.5606 112.4215 1.6270 10.0936 27.3238 0.1762 13.0156
temp: 298.150 k
press: 1.00000 atm
elementType: 8 8 7 7 6 6 6 6 6 6 1 1 1 1 1 1 1 1 1 1 1 1 1 1
symmnumber: 1
zpe: 537913.7 jmol-1
zpe.correction: 0.204881 hartree
zpe.thermalcorrener: 0.217562 hartree
zpe.thermalcorrenthalpy: 0.218506 hartree
zpe.thermalcorrgfe: 0.165013 hartree
zpe.sumelectzpe: -496.148554 hartree
zpe.sumelectthermal: -496.135873 hartree
zpe.sumelectthermalent: -496.134928 hartree
zpe.sumelectthermalfe: -496.188421 hartree
dipole: -1.9493 0.5445 -0.2525
dipole: 2.0396
quadrupole: -63.6763 -54.9150 -65.9702
quadrupole: -8.7412 -8.4601 -1.1390
quadrupole: -2.1558 6.6055 -4.4497 -8.7412 -8.4601 -1.1390
hfenergy: -496.3534347 hartree
pointgroup: C01 [X(C6H14N2O2)]
dipole: 0.7667378 -0.2192257 -0.0892272 debye
dipolederiv: -0.4663076 0.1133033 -0.145907 0.1885897 -0.8186719 0.4995837 -0.1622468 0.4314275 -0.6193432 -0.3927369 0.0798564 0.1243595 0.1711371 -0.5571823 -0.1364728 0.1233412 0.122777 -0.9480524 -0.8763858 -0.306858 0.0339307 -0.2878035 -0.5604531 0.2182703 0.0213554 0.102044 -0.3964169 -0.6990398 -0.0624778 0.0990949 -0.1010805 -0.3718792 0.238681 0.1280867 0.2472751 -0.5415401 -0.0871787 -0.0288073 -0.013943 -0.0593009 0.1429452 -0.0337225 -0.0019453 -0.0201249 0.0290914 0.0457394 -0.1311658 -0.0099974 0.0178465 0.0525423 -0.0098391 0.0314133 0.0836716 0.0856629 -0.0355857 -0.017848 -0.0328294 -0.0725624 0.1754071 0.0090697 -0.1257162 -0.0121541 0.0550163 0.2299631 0.2126334 0.0969859 0.2570813 0.2437934 -0.268015 0.0776306 -0.4104064 0.2329045 0.5725854 0.0576126 -0.1586745 0.0051311 0.2886715 -0.1104737 -0.0421679 -0.1194487 0.3084134 0.4000509 -0.315054 -0.0719529 -0.5421913 1.1102684 -0.1590589 -0.1094107 -0.2741339 1.3213171 0.0838962 -0.0016822 0.0126732 0.0118815 -0.0267931 0.1192544 0.0061897 0.1012715 -0.0797084 0.0280412 0.0414805 0.0198728 0.0587691 -0.1141089 -0.0952517 0.0285042 -0.0829088 0.0118635 -0.0008527 0.0799837 0.052418 0.0392971 -0.1109839 -0.1195387 0.0087641 -0.095706 0.0140219 0.039386 -0.0314344 0.0007477 -0.0238826 -0.0328986 0.1318352 -0.010361 0.0945347 -0.051968 0.0513124 -0.0035779 -0.002844 -0.0074187 -0.0158813 0.1146822 0.005276 0.1054278 -0.0832224 0.0171729 0.0389342 0.0242879 0.0718368 -0.147482 -0.1112914 0.0239888 -0.0897909 0.0139468 -0.0514171 -0.0193596 -0.0925706 -0.020647 0.024899 0.0096153 -0.088235 0.0497564 -0.1021272 -0.0861057 -0.0495208 0.0827564 -0.0751541 -0.0748873 0.1867513 0.0801642 0.1363913 -0.1856422 0.016505 0.0429177 0.0401405 0.0398915 -0.1379836 -0.1022284 0.0385312 -0.0694106 0.0228561 0.3582221 0.0433424 -0.098166 0.0154772 0.2279464 -0.0667635 -0.0422556 0.0162044 0.1184421 0.3027408 0.2328025 0.040819 0.1467836 0.167355 -0.0120412 0.0659575 0.0170975 0.1525258 0.1473654 0.015581 0.0234086 0.0792357 0.0197155 -0.1217844 0.0182609 -0.0547139 0.2992587 0.0215478 -0.0268947 -0.0669305 0.049909 0.2754329 -0.0940801 -0.1555832 -0.1393873 0.1406132 0.3810814 0.0362327 0.0423204 0.0371738 0.2402286 -0.0871817 0.0804577 -0.1396933 0.202087 unknown
polarizability: 93.8356295|-2.5981769|80.5492779|-2.1292502|0.9250711|80.1667319 unknown
InChI: InChI=1S/C6H14N2O2/c7-4-2-1-3-5(8)6(9)10/h5,9H,1-4,7-8H2
charge 0 multiplicity 1
24 atoms
O  -2.405992 1.53085 -0.800971
O  -2.384611 0.696758 1.365067
N  -1.874424 -1.861248 0.430827
N  4.635523 0.251893 0.111047
C  0.790697 -0.190344 0.08774
C  -0.221355 -0.542402 -1.022549
C  2.243217 -0.139768 -0.435148
C  -1.694645 -0.76144 -0.517309
C  3.264746 0.225752 0.661442
C  -2.197634 0.517895 0.140392
H  0.713148 -0.936045 0.905517
H  0.529475 0.790611 0.535222
H  0.088005 -1.483034 -1.523084
H  -0.228661 0.247623 -1.797855
H  2.336387 0.598127 -1.255172
H  2.511281 -1.12808 -0.86759
H  -2.318775 -0.921252 -1.419865
H  3.132667 -0.479039 1.520627
H  3.032541 1.23838 1.044866
H  -1.877652 -1.588105 1.416113
H  -1.372346 -2.722219 0.214217
H  4.945872 -0.649254 -0.26697
H  5.336551 0.666083 0.732641
H  -2.706012 2.356656 -0.332905
