program: Gaussian 09
title: 000057405
version: EM64L-G09RevD.01
frameworkgroup: C1[X(C8H9Cl3O2)]
method: RPBEPBE
basis: SDD
operation: Freq
keyword: #p
keyword: freq=noraman
keyword: PBEPBE/SDD
title: #p freq=noraman PBEPBE/SDD
converged: YES YES NO NO
title: Mulliken charges:
elementType: Cl Cl Cl O O C C C C C C C C H H H H H H H H H
charge: 0.145070 0.114638 0.105634 -0.254307 -0.183596 0.232939 -0.399549 -0.726651 -0.710303 0.246447 0.509117 -0.753810 -0.489400 0.219326 0.259452 0.248927 0.228726 0.232972 0.220351 0.238392 0.226823 0.288800
chargesum: 0.00000
title: Mulliken charges with hydrogens summed into heavy atoms:
elementType: Cl Cl Cl O O C C C C C C C C
charge: 0.145070 0.114638 0.105634 -0.254307 -0.183596 0.232939 0.079229 -0.016026 -0.024737 0.246447 0.509117 -0.753810 -0.200600
polarizability: 1.24348739e+02 -3.75790690e+00 1.25197144e+02 -4.10146523e+00 -3.98864900e+00 1.06988157e+02
1716.lowfreq: -9.0396 -6.5327 -0.0029 -0.0021 -0.0008 9.2241 18.2522 39.0428 78.1436
frequency: 17.5454 38.9886 78.1388 94.0214 100.4217 121.3534 147.2868 168.4163 194.2469 198.6306 211.0570 246.6499 256.0188 270.6940 275.7892 315.4211 346.2653 374.2911 397.8070 423.1111 527.0119 560.6630 609.4779 636.8663 653.3623 684.2152 726.9689 753.4063 758.3365 788.8689 805.4755 908.8029 924.1604 995.7519 1018.2631 1058.1606 1089.3999 1153.4156 1194.5906 1212.1469 1295.2908 1332.1076 1387.7612 1396.3651 1459.5056 1462.4592 1479.6745 1481.8695 1489.8931 1645.2711 2138.8085 2990.0724 3006.3307 3008.3842 3071.6993 3087.7960 3096.4858 3113.6737 3119.3446 3425.6719
redmass: 6.6164 7.6483 3.4765 7.2225 3.4120 3.8613 4.5478 5.0390 1.3077 4.3900 2.8129 2.4861 2.8522 4.5647 7.3349 6.2132 7.5782 2.6851 12.6779 5.9840 4.8683 6.1007 13.4487 1.2294 4.4668 1.2663 11.0280 4.9030 7.7235 3.1558 1.5832 1.7364 12.6742 1.8036 1.7125 1.8714 2.0626 6.0434 3.3431 2.3546 1.4391 1.3564 1.2096 1.1953 1.0494 1.0523 1.0424 1.0621 1.0638 12.8529 6.0183 1.0357 1.0583 1.0393 1.0994 1.0989 1.1017 1.1008 1.1005 1.1603
irintensity: 0.1458 0.5503 0.1596 0.8366 0.3318 1.7583 0.5329 2.1345 0.2770 0.0251 1.8194 0.3502 0.8600 0.9384 0.4078 6.7267 1.4073 0.5005 3.0710 5.3222 9.5672 20.3099 126.0835 62.9376 4.1444 53.0303 69.7117 32.4323 42.1331 123.9086 32.5969 13.1683 132.8038 41.5557 14.1569 10.4884 157.8326 202.4293 24.0097 23.4385 18.6346 6.5568 19.7155 16.5589 5.7232 4.3431 12.5314 11.0610 9.7115 140.9448 5.0069 26.9247 12.5552 10.3887 2.8893 27.7564 32.2156 18.0157 13.0771 61.5929
temp: 298.150 k
press: 1.00000 atm
elementType: 17 17 17 8 8 6 6 6 6 6 6 6 6 1 1 1 1 1 1 1 1 1
symmnumber: 1
zpe: 393714.7 jmol-1
zpe.correction: 0.149958 hartree
zpe.thermalcorrener: 0.165751 hartree
zpe.thermalcorrenthalpy: 0.166695 hartree
zpe.thermalcorrgfe: 0.105191 hartree
zpe.sumelectzpe: -1839.792555 hartree
zpe.sumelectthermal: -1839.776763 hartree
zpe.sumelectthermalent: -1839.775818 hartree
zpe.sumelectthermalfe: -1839.837322 hartree
dipole: -3.5563 -0.6068 1.0405
dipole: 3.7548
quadrupole: -90.7674 -90.9243 -99.5068
quadrupole: 0.2959 -1.0397 1.7259
quadrupole: 2.9654 2.8085 -5.7739 0.2959 -1.0397 1.7259
hfenergy: -1839.9425132 hartree
pointgroup: C01 [X(C8H9Cl3O2)]
dipole: -1.4134643 -0.2437659 0.3535091 debye
dipolederiv: -0.4147226 -0.1160596 0.3049272 -0.1267733 -0.1689626 0.1237627 0.2965726 0.1178836 -0.4105563 -0.2002108 -0.033648 -0.0631979 -0.0245794 -0.3251439 -0.2868962 -0.0765718 -0.3056495 -0.5692485 -0.205659 0.0913926 -0.0195093 0.0686682 -0.7517809 0.1012773 -0.0387112 0.1287911 -0.152945 -1.7556114 0.0071925 0.2812508 -0.2596189 -0.3793939 0.1184401 0.5341858 0.0804541 -0.5819733 -0.6549013 0.0718473 -0.1655339 -0.1209979 -0.2952618 0.1868154 0.200717 0.1496231 -0.7175129 1.2320144 -0.1443579 -0.1237792 -0.0795254 0.7011921 0.0141389 0.0259741 -0.0256433 0.3723086 -0.1426614 0.0267649 0.0530201 0.0187416 0.0353318 -0.0357511 -0.0106275 0.0391919 -0.0135618 -0.0808501 0.0181064 0.0211847 -0.001396 -0.0416823 0.0174494 0.0440691 -0.0038874 -0.0960116 0.0045999 0.0296186 -0.0166747 -0.0692127 0.0295539 -0.0393282 -0.082079 -0.0450904 0.0754014 -0.1919133 -0.1021032 0.0134532 0.0317068 -0.1556645 0.0148879 -0.0615845 0.011431 -0.1187253 1.6516892 -0.0813383 0.0564059 0.2821668 0.1531118 -0.3466218 -0.5466346 -0.2634391 0.9065569 0.557708 0.108255 -0.3082161 0.1383269 1.3270674 0.0858179 -0.3512081 0.0820281 1.148308 -0.2898649 0.0696673 -0.0060233 0.0625489 -0.3478782 -0.0175468 0.0164876 -0.0164533 -0.2521918 0.0297041 0.0629568 -0.0489123 0.0763113 -0.1087014 0.0216268 -0.0452948 0.0301522 0.0496161 0.0486823 -0.0120569 0.0669563 -0.0188715 0.0784892 0.0340358 0.0740059 0.0093922 -0.0296131 0.0960968 -0.0458567 -0.0764923 -0.0561109 0.0273663 -0.0856896 -0.0431626 -0.0719687 -0.0097153 -0.1180664 0.0114722 0.0103348 0.0108873 0.1003138 0.0246576 0.0006174 0.0149814 0.1069016 0.1042788 0.0560491 -0.0032386 0.0495127 -0.1076303 0.0530351 0.0106542 0.0434656 0.0681805 -0.0050538 -0.0316343 0.0658622 -0.030249 0.0675681 0.0673435 0.1289594 0.0916379 -0.0689936 0.0452844 0.061597 -0.007444 0.1096276 -0.0719425 0.0646716 -0.0007903 0.0495688 0.0917131 0.0343929 -0.0404642 -0.0317778 -0.0550817 -0.00214 -0.1221852 -0.0715134 -0.1319246 -0.0540826 0.2550641 -0.0074007 -0.0025956 -0.0060813 0.2361881 0.0060589 -0.0040653 0.0154555 0.256145 unknown
polarizability: 124.8139337|-3.7162345|124.6373704|-3.0041179|-5.0858228|107.0827359 unknown
InChI: InChI=1S/C8H9Cl3O2/c1-4-7(3,5-2)13-6(12)8(9,10)11/h1H,5H2,2-3H3
charge 0 multiplicity 1
22 atoms
Cl 3.629391 0.443805 -1.127946
Cl 2.645445 0.9051 1.690158
Cl 2.696055 -1.907174 0.523924
O  0.078407 -0.322122 0.584182
O  0.684416 0.533188 -1.517247
C  -1.447427 -0.197871 0.35444
C  -1.832798 -1.185977 -0.780875
C  -1.998093 -0.60517 1.733933
C  -3.353246 -1.256236 -1.038871
C  -1.777148 1.204038 0.041212
C  0.954344 0.084337 -0.390076
C  2.410871 -0.101628 0.139389
C  -2.104135 2.371788 -0.173289
H  -1.446737 -2.182584 -0.493641
H  -1.319014 -0.875997 -1.706479
H  -1.582999 0.049397 2.516907
H  -3.096143 -0.511864 1.744384
H  -1.719225 -1.649146 1.955235
H  -3.90744 -1.649488 -0.168305
H  -3.760446 -0.260577 -1.289728
H  -3.554546 -1.926864 -1.892834
H  -2.367533 3.392143 -0.385472
