program: Gaussian 09
title: 000057323
version: EM64L-G09RevD.01
frameworkgroup: C1[X(C17H14N2)]
method: RPBEPBE
basis: SDD
operation: Freq
keyword: #pfreq=noraman
keyword: PBEPBE/SDD
title: #p freq=noraman PBEPBE/SDD
converged: YES YES NO NO
title: Mulliken charges:
elementType: N N C C C C C C C C C C C C C C C C C H H H H H H H H H H H H H H
charge: -0.404854 -0.018186 -0.033720 0.364974 -0.556387 0.255118 0.223389 -0.498627 -0.109416 -0.419644 -0.418912 -0.370398 0.332246 -0.223971 -0.388465 -0.389318 -0.239550 -0.233704 -0.242885 0.235822 0.210215 0.221862 0.209884 0.267696 0.306437 0.264015 0.232270 0.224448 0.260065 0.265037 0.224572 0.223943 0.226046
chargesum: 0.00000
title: Mulliken charges with hydrogens summed into heavy atoms:
elementType: N N C C C C C C C C C C C C C C C C C
charge: -0.098417 -0.018186 -0.033720 0.364974 -0.110350 0.255118 0.223389 -0.066881 -0.109416 -0.151948 -0.154897 -0.138128 0.332246 0.000476 -0.128400 -0.124281 -0.014978 -0.009762 -0.016838
polarizability: 2.75437591e+02 7.58814021e+00 2.09115881e+02 1.22389732e+01 -4.42774598e+00 1.11320953e+02
1716.lowfreq: -1.3739 -0.0006 -0.0005 -0.0004 6.0238 12.5061 43.7948 65.4688 82.7388
frequency: 43.7938 65.4658 82.7361 137.7982 152.6964 212.3914 235.7484 255.5925 262.1676 281.9447 344.9213 375.4062 408.4211 410.5791 460.6639 472.1946 503.3053 519.7551 531.0677 572.4964 578.3148 614.8862 618.0929 634.4609 655.1824 697.0871 698.9487 704.6985 758.0103 774.8226 791.9247 798.8596 809.8068 856.4157 860.7770 880.4123 907.6988 934.9150 943.4500 967.7538 983.6587 987.7575 990.9079 996.3024 1024.4976 1042.5045 1052.2513 1060.0905 1083.9629 1088.6822 1115.5597 1163.4161 1167.9816 1170.6954 1187.8903 1215.5334 1230.2905 1252.5336 1273.6038 1285.6220 1308.0518 1317.1954 1349.4720 1356.8339 1379.4046 1391.8658 1413.8782 1432.0527 1442.6390 1461.0733 1476.4022 1478.4846 1488.4745 1552.8278 1567.5735 1580.5901 1589.1251 1609.2884 1621.9750 2950.6314 2980.8007 3034.5654 3043.1030 3121.4763 3129.1187 3132.3292 3146.2192 3147.7315 3157.2983 3165.6771 3167.6518 3221.4839 3614.3010
redmass: 4.5631 4.2767 4.5583 3.6407 4.1053 4.5601 4.2756 4.8897 3.1812 4.1347 4.0277 4.4026 3.3513 3.8744 4.8738 4.5619 1.3118 3.3006 3.7583 3.0966 3.6029 5.6029 5.7268 3.3412 5.5335 4.9255 4.6632 1.7191 1.7371 1.9699 1.6576 3.5780 2.8174 1.4276 2.2905 4.6690 1.4119 1.4813 2.3166 1.3288 1.3738 3.9531 4.6637 1.3266 2.5003 2.4418 3.0150 2.3396 1.6163 2.3287 1.7597 1.1914 1.3461 1.0587 1.1187 1.6272 1.5903 1.5222 2.7695 2.0322 1.5007 1.3881 2.3475 1.4751 8.1916 6.0278 1.9751 2.2477 4.9881 1.1469 1.1418 2.3198 2.8947 6.6921 6.4254 6.6202 6.7892 6.1649 6.8368 1.0667 1.0608 1.1017 1.0949 1.0845 1.0866 1.0885 1.0930 1.0927 1.0963 1.0971 1.0993 1.0984 1.0810
irintensity: 0.9771 0.6913 1.5209 2.6296 0.1306 3.6208 4.0396 0.7373 4.7092 3.9147 2.6609 0.5794 0.3780 0.8961 4.9234 3.8176 82.5040 19.8666 2.3471 3.4289 11.4977 2.0005 1.1722 0.7221 14.7580 0.6727 1.3935 72.7708 73.4452 20.4690 26.2363 23.1467 8.0266 1.2246 1.7526 16.2563 0.1577 2.3064 4.6047 1.7013 2.4851 0.2133 0.8576 0.1656 13.0297 0.1303 2.5614 15.3787 12.9884 25.9727 33.0847 1.1423 3.6035 0.4718 8.1233 8.3205 6.8545 15.7633 58.4289 50.1989 2.3828 5.2790 30.3695 6.1993 0.5226 35.5793 16.8010 10.4281 14.0650 9.4687 16.7270 4.4449 1.8135 58.0059 2.3967 7.5189 9.6622 0.9978 1.1325 53.8530 40.9907 17.9655 86.1152 0.5417 2.0808 10.2500 50.9644 8.1415 21.3126 16.0677 19.6166 1.0733 71.3880
temp: 298.150 k
press: 1.00000 atm
elementType: 7 7 6 6 6 6 6 6 6 6 6 6 6 6 6 6 6 6 6 1 1 1 1 1 1 1 1 1 1 1 1 1 1
symmnumber: 1
zpe: 693947.7 jmol-1
zpe.correction: 0.264311 hartree
zpe.thermalcorrener: 0.278401 hartree
zpe.thermalcorrenthalpy: 0.279345 hartree
zpe.thermalcorrgfe: 0.223460 hartree
zpe.sumelectzpe: -764.414315 hartree
zpe.sumelectthermal: -764.400225 hartree
zpe.sumelectthermalent: -764.399281 hartree
zpe.sumelectthermalfe: -764.455166 hartree
dipole: 3.9893 -1.6659 0.3914
dipole: 4.3409
quadrupole: -82.9366 -103.1461 -112.9103
quadrupole: 0.8778 3.5121 -1.9457
quadrupole: 16.7277 -3.4818 -13.2459 0.8778 3.5121 -1.9457
hfenergy: -764.6786262 hartree
pointgroup: C01 [X(C17H14N2)]
dipole: 1.5578675 -0.5840603 0.3855403 debye
polarizability: 274.7642044|11.6483016|198.2714592|14.0208661|-30.6658719|122.8387616 unknown
InChI: InChI=1S/C17H14N2/c1-2-5-12(6-3-1)17-14-7-4-8-15-16(14)13(11-19-15)9-10-18-17/h1-8,11,19H,9-10H2
charge 0 multiplicity 1
33 atoms
N  3.963655 -0.416276 0.735307
N  -0.465048 1.774394 -0.988567
C  1.791782 -0.06476 0.121726
C  2.458216 1.219921 0.201429
C  1.824099 2.528287 -0.189497
C  0.447461 -0.444534 -0.192381
C  2.763969 -1.076324 0.449011
C  0.851702 2.31416 -1.390686
C  -0.624598 0.569843 -0.475411
C  3.778383 0.966324 0.572123
C  0.163357 -1.835442 -0.225214
C  2.463571 -2.453763 0.42714
C  -2.050713 0.212024 -0.13917
C  1.149147 -2.817007 0.065947
C  -2.384012 -0.550318 1.012906
C  -3.102295 0.706282 -0.956106
C  -3.734095 -0.815396 1.334488
C  -4.449337 0.431096 -0.64277
C  -4.772019 -0.332542 0.505033
H  1.238749 2.97002 0.641302
H  2.598799 3.268971 -0.464864
H  0.658457 3.286808 -1.87704
H  1.351982 1.653962 -2.132283
H  4.601646 1.66406 0.716168
H  4.837081 -0.867923 0.995654
H  -0.846611 -2.164612 -0.487229
H  3.213669 -3.214607 0.669915
H  0.877487 -3.877018 0.015963
H  -1.588356 -0.918233 1.669407
H  -2.835848 1.316487 -1.824646
H  -3.974477 -1.394133 2.23368
H  -5.248093 0.812122 -1.289385
H  -5.818909 -0.544572 0.750849
