program: Gaussian 09
title: 000057258
version: EM64L-G09RevD.01
frameworkgroup: C1[X(C13H5Cl7O2)]
method: RPBEPBE
basis: SDD
operation: Freq
keyword: #p
keyword: freq=noraman
keyword: PBEPBE/SDD
title: #p freq=noraman PBEPBE/SDD
converged: YES YES NO NO
title: Mulliken charges:
elementType: Cl Cl Cl Cl Cl Cl Cl O O C C C C C C C C C C C C C H H H H H
charge: 0.047290 0.035348 -0.004060 0.060384 0.029875 0.062583 0.029664 -0.254672 -0.259205 0.569940 0.577517 -0.402407 -0.318097 0.553348 -0.231013 -0.307227 -0.225036 -0.299679 -0.089136 -0.234619 -0.114291 -0.514217 0.287494 0.291682 0.231650 0.231851 0.245033
chargesum: 0.00000
title: Mulliken charges with hydrogens summed into heavy atoms:
elementType: Cl Cl Cl Cl Cl Cl Cl O O C C C C C C C C C C C C C
charge: 0.047290 0.035348 -0.004060 0.060384 0.029875 0.062583 0.029664 -0.254672 -0.259205 0.569940 0.577517 -0.402407 -0.030603 0.553348 -0.231013 -0.307227 -0.225036 -0.299679 -0.089136 0.057063 -0.114291 0.194317
polarizability: 3.03214550e+02 -2.15674866e+01 1.92901305e+02 -7.89728655e+00 -2.05708407e-01 1.77164303e+02
1716.lowfreq: -7.0162 -4.6313 0.0020 0.0021 0.0029 3.4901 10.2308 14.1176 28.0899
frequency: 9.7159 13.3875 28.0772 47.6688 61.2750 68.4877 78.0306 82.3640 124.9615 130.1102 145.7964 147.2194 182.6212 186.2522 195.3395 201.1347 203.9568 212.7007 263.2386 270.1129 276.3302 291.1706 313.9277 315.4196 331.2953 353.8078 367.2007 414.9356 434.3846 472.8288 518.4960 520.0294 528.4582 559.1591 594.8222 599.7214 638.5526 647.6078 693.5379 740.8109 748.1309 759.8017 775.0143 792.9640 845.4046 854.4515 867.7421 933.2941 974.2178 1065.2093 1081.0531 1107.8446 1151.4114 1156.8444 1184.3444 1221.8462 1268.3695 1324.0583 1329.9595 1344.5496 1365.5061 1399.8329 1409.1637 1447.1165 1463.8362 1465.2270 1542.4863 1550.0796 1558.3101 1585.4732 2978.6439 3076.7686 3135.9310 3175.4482 3187.5345
redmass: 13.5991 19.5101 15.8602 3.4211 7.0700 25.7415 10.2703 18.7574 23.5394 9.7462 8.1126 1.1172 23.2705 12.6051 23.8239 14.7512 10.4956 9.9974 7.7309 11.1696 9.7725 10.3304 22.9049 21.5500 15.3845 31.6900 13.6255 10.0929 10.5329 10.7411 4.5730 4.8757 7.8762 8.9633 10.0705 9.5957 9.4687 8.3042 9.0963 8.5321 8.0442 7.6702 10.8861 10.9265 1.5101 1.4036 10.0118 10.4134 10.2908 8.5550 5.0582 1.2327 1.3491 1.8893 1.7457 4.7712 9.0762 9.4442 9.2819 11.6762 8.8519 3.9998 2.3623 1.5353 1.0538 1.0529 10.7318 9.7327 9.2344 9.0804 1.0305 1.1057 1.1019 1.0920 1.0934
irintensity: 0.2745 0.2923 0.1068 4.5799 0.9886 0.0459 0.8037 0.2343 0.2260 0.8958 0.0963 0.1635 0.2310 0.6997 0.3374 0.9200 1.7295 1.2381 1.8732 1.5720 1.4273 0.4582 0.1629 0.3177 0.1148 0.1653 1.6570 2.9170 3.9553 6.2830 1.1464 7.4934 13.6488 7.4003 18.5438 12.2142 18.1143 1.4064 19.8042 9.1010 13.2295 43.5806 58.0245 47.9296 21.6256 19.0369 19.0330 142.4419 50.9870 35.5685 61.5709 0.0421 4.3589 54.1383 66.8977 79.2002 16.9865 32.4349 167.0816 21.9773 91.1393 403.1608 124.2277 113.2890 11.1896 8.8208 15.5385 7.2423 8.1844 81.7062 54.6933 25.3634 20.2830 0.4652 3.4181
temp: 298.150 k
press: 1.00000 atm
elementType: 17 17 17 17 17 17 17 8 8 6 6 6 6 6 6 6 6 6 6 6 6 6 1 1 1 1 1
symmnumber: 1
zpe: 379173.2 jmol-1
zpe.correction: 0.144419 hartree
zpe.thermalcorrener: 0.167039 hartree
zpe.thermalcorrenthalpy: 0.167983 hartree
zpe.thermalcorrgfe: 0.087482 hartree
zpe.sumelectzpe: -3867.616489 hartree
zpe.sumelectthermal: -3867.593870 hartree
zpe.sumelectthermalent: -3867.592926 hartree
zpe.sumelectthermalfe: -3867.673427 hartree
dipole: -1.0065 1.6881 -0.3940
dipole: 2.0044
quadrupole: -169.8159 -175.9865 -172.1352
quadrupole: 7.7632 -13.7952 -4.8512
quadrupole: 2.8300 -3.3406 0.5106 7.7632 -13.7952 -4.8512
hfenergy: -3867.7609088 hartree
pointgroup: C01 [X(C13H5Cl7O2)]
dipole: -0.3743019 -0.6777723 0.1497211 debye
polarizability: 302.0794904|24.6172795|194.246498|6.471929|-0.0622929|176.9541701 unknown
InChI: InChI=1S/C13H5Cl7O2/c1-21-12-6(16)3-7(9(18)11(12)20)22-13-5(15)2-4(14)8(17)10(13)19/h2-3H,1H3
charge 0 multiplicity 1
27 atoms
Cl 1.962918 2.99743 0.815051
Cl 4.801862 1.416633 0.47017
Cl 2.033824 -3.148894 -1.037322
Cl -1.527952 0.05536 2.644556
Cl -1.362291 1.588111 -2.67146
Cl -4.545786 -1.076153 2.23057
Cl -5.923661 -0.831373 -0.709212
O  -0.382815 1.351246 0.194089
O  4.488084 -1.420547 -0.505216
C  0.801992 0.596939 0.033699
C  -1.627131 0.743683 -0.032335
C  2.015929 1.275812 0.299331
C  0.806244 -0.751758 -0.371386
C  3.273809 -0.77703 -0.262954
C  3.235603 0.58401 0.151136
C  2.035976 -1.416548 -0.509508
C  -2.337947 0.154691 1.043773
C  -2.253121 0.836523 -1.29657
C  -3.652788 -0.33525 0.86053
C  -3.558252 0.355251 -1.498442
C  -4.249138 -0.227166 -0.418123
C  5.076025 -2.132577 0.656278
H  -0.130196 -1.275743 -0.57776
H  -4.033506 0.432836 -2.478839
H  4.404816 -2.94475 0.990559
H  5.273008 -1.427217 1.484169
H  6.021893 -2.552218 0.285018
