program: Gaussian 09
title: 000006490
version: EM64L-G09RevD.01
frameworkgroup: C1[X(C12H24O3)]
method: RPBEPBE
basis: SDD
operation: Freq
keyword: #pfreq=noraman
keyword: PBEPBE/SDD
title: #p freq=noraman PBEPBE/SDD
converged: YES YES NO NO
title: Mulliken charges:
elementType: O O O C C C C C C C C C C C C H H H H H H H H H H H H H H H H H H H H H H H H
charge: -0.476058 -0.290583 -0.246716 0.259617 -0.092408 -0.056781 -0.321686 -0.754037 -0.739267 -0.765586 -0.739370 0.272768 -0.185250 -0.686146 -0.690432 0.220505 0.208830 0.226247 0.266978 0.233482 0.210389 0.217204 0.205375 0.256358 0.209047 0.247818 0.221273 0.197203 0.205754 0.247717 0.214158 0.346882 0.230801 0.219783 0.230855 0.224694 0.212094 0.220034 0.238454
chargesum: 0.00000
title: Mulliken charges with hydrogens summed into heavy atoms:
elementType: O O O C C C C C C C C C C C C
charge: -0.129176 -0.290583 -0.246716 0.259617 0.128097 0.152049 0.171539 -0.092962 -0.068486 -0.099292 -0.071741 0.272768 0.045551 -0.010815 -0.019850
polarizability: 1.61437707e+02 8.88956871e-01 1.35818559e+02 1.28684556e+00 -1.03487030e+00 1.24611825e+02
1716.lowfreq: -21.3800 -14.3412 -10.9832 -4.8689 -0.0007 -0.0005 0.0004 16.5359 31.8742
frequency: -15.2698 14.9629 31.7009 47.1829 66.5771 100.8749 139.6828 182.0393 184.6532 192.4957 200.4595 220.1327 227.1112 242.2227 260.1828 270.5538 277.6826 284.7904 287.7207 300.0291 321.8803 333.9294 353.4097 358.2207 381.9145 422.5850 476.0286 494.0232 516.9433 556.7247 637.7882 712.6508 746.6097 812.6694 844.0417 877.3321 881.6480 911.5767 915.0529 924.9021 936.1709 939.5833 951.1572 953.6749 962.1164 974.9687 989.7629 1019.8881 1095.1362 1104.1031 1105.4972 1115.8189 1116.6305 1141.7545 1175.7994 1176.4320 1179.3692 1223.1133 1254.4033 1272.5789 1283.7716 1299.0329 1311.6974 1331.4193 1349.5429 1353.9468 1364.6309 1374.2332 1375.3943 1378.7283 1393.3774 1397.1642 1398.7589 1456.4551 1462.4872 1466.0347 1468.0231 1470.5177 1474.2800 1476.8592 1477.5893 1484.7485 1485.3180 1489.0069 1494.5919 1496.9179 1636.8343 2954.1886 2962.3700 2974.2559 2980.4448 2982.6047 2984.7608 2986.3226 2987.1225 3015.1795 3026.0022 3053.3243 3064.9746 3068.2608 3072.8041 3081.9690 3085.0712 3087.1768 3088.0397 3088.4682 3091.2327 3094.7884 3096.6772 3100.7104 3591.0162
redmass: 2.8253 6.9644 3.1250 3.6727 2.9125 3.6466 3.5416 1.1684 1.2569 1.8399 1.6619 1.3889 1.4039 2.2537 2.8500 2.6622 1.2561 2.6176 1.1497 2.1523 2.0754 1.5630 2.3548 2.1019 2.5410 2.4929 2.6836 3.3365 3.5452 3.7351 3.2169 6.1918 2.9282 3.6770 2.5471 4.2260 2.2183 1.2229 1.9311 1.1669 1.9294 1.7004 1.7386 2.0167 1.4499 1.7767 1.9041 1.7012 1.5962 1.7316 3.3454 2.0952 2.9338 1.8029 1.7964 1.9275 1.4540 1.8838 2.3752 1.6189 1.4624 1.3405 1.3578 1.5249 1.2284 1.5375 1.3958 1.1949 1.2108 1.2234 1.2063 1.2252 1.2106 1.0745 1.0453 1.0503 1.0558 1.0485 1.0471 1.0498 1.0495 1.0511 1.0510 1.0595 1.0519 1.0622 9.3851 1.0835 1.0419 1.0397 1.0364 1.0342 1.0490 1.0653 1.0354 1.0590 1.0849 1.0952 1.0976 1.0987 1.0978 1.1008 1.1002 1.1008 1.0994 1.0989 1.0984 1.1050 1.0997 1.0999 1.0662
irintensity: 0.0125 1.7318 0.0808 0.2521 0.2953 1.2526 2.6170 0.0871 0.2905 0.1397 0.3706 1.5673 1.4164 1.3133 9.2231 3.6817 2.4551 3.8601 58.0690 33.4117 9.6774 57.5377 12.9498 10.8583 1.1278 1.6191 2.7205 12.1459 1.7158 6.1338 0.0502 3.8720 8.7613 12.4104 2.1457 11.6228 5.4067 2.3691 10.2888 6.7616 46.2358 10.2480 21.4175 25.7857 0.0623 11.0848 48.9724 3.1787 38.2724 0.1142 257.8862 8.2119 184.2933 19.0565 10.9667 4.2971 8.5663 22.2351 7.5424 7.6154 2.8308 5.1790 0.3711 22.9218 2.6006 17.8002 0.7907 8.4997 17.7458 34.7533 38.9830 31.1810 4.0154 7.3347 6.7729 0.8278 7.2664 1.9349 7.0589 15.5526 2.9323 0.2646 26.4433 21.1541 7.3832 35.9806 180.7707 27.1881 25.8256 27.7869 20.5359 28.6655 4.5672 58.6500 27.3355 18.7330 8.6008 14.3453 70.3341 7.6691 87.0118 17.5949 37.8505 29.0128 14.3239 35.4368 27.4349 6.4387 40.5540 26.3121 3.6662
temp: 298.150 k
press: 1.00000 atm
elementType: 8 8 8 6 6 6 6 6 6 6 6 6 6 6 6 1 1 1 1 1 1 1 1 1 1 1 1 1 1 1 1 1 1 1 1 1 1 1 1
symmnumber: 1
zpe: 895213.9 jmol-1
zpe.correction: 0.340969 hartree
zpe.thermalcorrener: 0.359637 hartree
zpe.thermalcorrenthalpy: 0.360581 hartree
zpe.thermalcorrgfe: 0.293989 hartree
zpe.sumelectzpe: -696.101212 hartree
zpe.sumelectthermal: -696.082544 hartree
zpe.sumelectthermalent: -696.081599 hartree
zpe.sumelectthermalfe: -696.148192 hartree
dipole: -1.9930 -2.6615 1.4324
dipole: 3.6204
quadrupole: -94.1051 -92.8562 -95.4003
quadrupole: -5.6270 2.9000 5.1337
quadrupole: 0.0154 1.2643 -1.2798 -5.6270 2.9000 5.1337
hfenergy: -696.4421808 hartree
pointgroup: C01 [X(C12H24O3)]
dipole: -0.8151297 0.8608423 -0.7895393 debye
polarizability: 161.3178621|-1.2970508|134.5139719|-2.31569|-3.6923308|126.0362569 unknown
InChI: InChI=1S/C12H24O3/c1-8(2)10(13)12(5,6)7-15-11(14)9(3)4/h8-10,13H,7H2,1-6H3
charge 0 multiplicity 1
39 atoms
O  -1.709832 0.614031 1.722228
O  1.100201 -0.220726 -0.134232
O  2.984251 -1.059315 0.950495
C  -1.198311 -1.086938 0.095438
C  -1.741809 0.373013 0.259298
C  -3.153223 0.646208 -0.375572
C  0.237852 -1.147331 0.663779
C  -1.17785 -1.523895 -1.391366
C  -2.046327 -2.087468 0.927334
C  -4.039684 1.549703 0.516075
C  -3.003112 1.289376 -1.777615
C  2.47098 -0.265381 0.127848
C  3.218579 0.793667 -0.680223
C  3.44298 2.038046 0.224922
C  4.55941 0.22919 -1.200929
H  -1.011644 1.059819 -0.222161
H  -3.687142 -0.318662 -0.488209
H  0.658864 -2.16641 0.585325
H  0.263985 -0.818128 1.715545
H  -0.563342 -0.841908 -2.004653
H  -0.742725 -2.537545 -1.475413
H  -2.196054 -1.565887 -1.817124
H  -1.61891 -3.10544 0.858425
H  -2.082427 -1.785243 1.9872
H  -3.083612 -2.138339 0.550461
H  -4.211572 1.100138 1.508812
H  -5.022594 1.705759 0.034863
H  -3.589201 2.553797 0.656807
H  -2.537589 2.290913 -1.694873
H  -2.374382 0.683172 -2.451464
H  -3.990736 1.417422 -2.258484
H  -1.91265 1.566089 1.893535
H  2.572462 1.086561 -1.527711
H  3.953891 2.831965 -0.349059
H  4.07495 1.774538 1.092027
H  2.485722 2.442387 0.599786
H  5.124976 1.018012 -1.728914
H  4.401266 -0.610666 -1.901024
H  5.170256 -0.141227 -0.35928
