program: Gaussian 09
title: 000057227
version: EM64L-G09RevD.01
frameworkgroup: C1[X(C14H24N3O)]
method: RPBEPBE
basis: SDD
operation: Freq
keyword: #p
keyword: freq=noraman
keyword: PBEPBE/SDD
title: #p freq=noraman PBEPBE/SDD
converged: YES YES NO NO
title: Mulliken charges:
elementType: O N N N C C C C C C C C C C C C C C H H H H H H H H H H H H H H H H H H H H H H H H
charge: -0.334548 -0.090727 -0.415760 -0.672294 -0.343991 -0.309893 -0.307765 -0.640540 -0.404736 -0.692856 -0.698597 0.185473 0.282147 -0.334297 -0.312878 -0.408551 -0.424337 0.509943 0.256949 0.321120 0.255174 0.261796 0.256769 0.270570 0.347076 0.259022 0.253233 0.255702 0.251808 0.259556 0.258683 0.245931 0.264227 0.251966 0.242466 0.319673 0.271206 0.191240 0.235383 0.233041 0.325029 0.326588
chargesum: 1.00000
title: Mulliken charges with hydrogens summed into heavy atoms:
elementType: O N N N C C C C C C C C C C C C C C
charge: -0.334548 -0.090727 -0.096087 -0.020677 0.234078 0.207077 0.219574 0.218791 0.102774 0.071314 0.060061 0.185473 0.282147 -0.063091 -0.121639 -0.173167 -0.191296 0.509943
polarizability: 2.93197001e+02 -1.28710001e+01 1.51769108e+02 -1.15231237e+01 -1.83399148e+01 1.24056962e+02
1716.lowfreq: -13.8847 -6.9920 -0.0005 -0.0001 0.0004 4.0804 12.0194 30.3833 45.7291
frequency: 8.0106 29.8323 45.6025 60.1606 85.9693 110.0221 118.0113 130.5872 140.0464 193.4843 218.9039 239.8728 257.1484 260.5143 269.4144 285.6333 300.3954 331.9583 366.4111 373.7876 385.3647 393.5822 402.1743 436.3300 439.8167 476.9108 478.5471 495.3677 501.6866 518.9083 542.1136 614.1585 633.7518 684.8086 690.4855 752.0184 758.8032 792.1264 802.7700 804.9693 811.2411 834.8215 847.4027 852.8367 902.5293 933.6937 935.5846 989.5294 991.0998 1013.1742 1019.9843 1026.4088 1028.1644 1037.2340 1070.6051 1082.1320 1112.6906 1127.6704 1139.5824 1151.6091 1167.9550 1190.2444 1200.7875 1201.6794 1260.5238 1289.6868 1293.5075 1309.1298 1314.6692 1319.1499 1343.1170 1347.9646 1362.4667 1374.5971 1386.9090 1390.4557 1410.7534 1417.8208 1433.2604 1448.7337 1457.7457 1458.0999 1464.6046 1468.2660 1478.0800 1479.2739 1481.1538 1484.5691 1490.4738 1492.7723 1507.9165 1520.2952 1547.1123 1582.2565 1635.4735 1654.2972 3006.9579 3008.5831 3009.7196 3012.4954 3021.8761 3026.6205 3036.7989 3082.7242 3086.2872 3094.5242 3098.0721 3099.8094 3111.5519 3119.0270 3122.1698 3127.1276 3135.6406 3140.9932 3144.8759 3144.9893 3166.3017 3552.5269 3585.4585 3689.4539
redmass: 3.3166 4.3958 3.9276 4.6432 2.0219 2.1911 5.1688 3.9168 2.7411 2.3047 1.6001 1.6389 1.4731 2.0816 1.2522 4.0162 3.7569 2.6042 3.1911 2.5808 2.7219 2.8517 2.7166 2.3780 1.0711 1.5959 3.9556 1.3460 2.3789 1.9744 2.9910 5.1418 6.8986 3.4624 3.3573 2.0233 3.7660 1.2848 1.2367 1.4347 2.9638 3.8589 1.6908 2.1823 2.2946 2.6390 1.4988 1.4834 2.7615 2.2456 1.7717 2.0431 2.9242 2.6146 1.9435 1.5799 1.9584 1.6216 1.2711 2.4627 1.7175 1.7516 1.1923 1.6869 1.3510 1.1481 1.8010 1.2799 1.4006 1.1849 2.5940 1.2434 1.2729 1.3191 3.0701 1.3196 1.1987 1.1960 1.3055 1.4020 1.2577 1.4126 1.3471 1.0664 1.5562 1.0752 1.0668 1.0526 1.0657 1.0994 1.0605 3.0148 4.4218 5.3587 3.8481 1.3396 1.0576 1.0396 1.0378 1.0364 1.0605 1.0616 1.0645 1.1003 1.1044 1.1025 1.0979 1.0983 1.0873 1.1028 1.1031 1.1042 1.0894 1.1014 1.1049 1.0958 1.0957 1.0457 1.0786 1.1040
irintensity: 0.2245 2.1990 2.7603 11.9929 0.7289 2.1553 0.9436 6.4898 8.8192 0.9370 0.1784 0.3780 0.4508 2.6279 2.3223 7.5141 11.4707 0.3932 1.0457 4.6525 6.9363 4.1840 3.6872 2.9537 0.9867 15.3340 3.4094 332.4903 68.5204 2.2340 5.5726 11.4296 2.4076 5.6474 23.7770 18.3972 21.6272 16.0703 9.0305 15.3339 7.2675 1.1368 54.5855 10.6493 6.8381 15.4423 2.4385 0.4164 0.6556 23.4486 12.3025 23.0892 5.9547 18.2373 6.7281 0.8226 8.7723 17.4948 34.5545 11.3481 4.2924 3.3088 149.7998 8.4847 80.5358 2.4355 182.7384 38.2777 20.7808 47.0021 84.6761 17.0761 0.9035 1.4166 0.5346 42.1485 21.7476 41.7136 14.7209 78.3038 16.0348 9.7151 33.0974 8.3422 212.0557 137.2367 29.3273 26.5546 14.9282 78.0817 82.3696 92.2878 161.9105 178.4175 198.9327 347.6680 19.0083 3.1906 9.0570 78.1724 8.6474 11.4339 15.1982 10.4448 0.6989 2.7911 7.4621 10.8800 20.7987 20.5088 13.2339 43.3052 10.6583 2.3100 3.2738 16.4108 4.8921 174.2628 17.9783 31.4311
temp: 298.150 k
press: 1.00000 atm
elementType: 8 7 7 7 6 6 6 6 6 6 6 6 6 6 6 6 6 6 1 1 1 1 1 1 1 1 1 1 1 1 1 1 1 1 1 1 1 1 1 1 1 1
symmnumber: 1
zpe: 966755.1 jmol-1
zpe.correction: 0.368218 hartree
zpe.thermalcorrener: 0.387843 hartree
zpe.thermalcorrenthalpy: 0.388788 hartree
zpe.thermalcorrgfe: 0.318889 hartree
zpe.sumelectzpe: -785.757955 hartree
zpe.sumelectthermal: -785.738329 hartree
zpe.sumelectthermalent: -785.737385 hartree
zpe.sumelectthermalfe: -785.807284 hartree
dipole: 7.0176 -1.8143 2.4226
dipole: 7.6425
quadrupole: 10.1698 -91.3385 -103.8507
quadrupole: -1.7832 -1.8999 -3.8424
quadrupole: 71.8429 -29.6654 -42.1775 -1.7832 -1.8999 -3.8424
hfenergy: -786.1261726 hartree
pointgroup: C01 [X(C14H24N3O1)]
dipole: -2.7345839 0.8792233 0.8886491 debye
polarizability: 292.2410026|-16.4164299|155.4962088|13.2369146|15.4029858|121.2858598 unknown
InChI: InChI=1S/C14H24N3O/c1-4-17(3,5-2)11-10-16-14(18)12-6-8-13(15)9-7-12/h6-9,16H,4-5,10-11,15H2,1-3H3
charge 1 multiplicity 1
42 atoms
O  -0.136085 -0.658302 -0.850163
N  -3.601273 0.081557 0.149461
N  -0.044233 1.402345 0.173044
N  6.239959 -0.495908 0.264648
C  -2.299405 0.605444 0.796419
C  -4.283714 -0.899214 1.142312
C  -4.547929 1.2843 -0.105101
C  -3.283077 -0.647376 -1.166263
C  -1.473574 1.580077 -0.092751
C  -3.447575 -2.127779 1.520071
C  -5.893788 0.931991 -0.74959
C  0.59055 0.241067 -0.288098
C  2.050336 0.104074 -0.105004
C  2.676848 -1.059616 -0.638088
C  2.872379 1.059681 0.560804
C  4.054699 -1.265284 -0.520969
C  4.253905 0.866753 0.688198
C  4.876314 -0.302163 0.145821
H  -2.588405 1.070728 1.755284
H  -1.677622 -0.278762 0.987547
H  -4.53736 -0.301811 2.036415
H  -5.2217 -1.212244 0.656547
H  -4.695338 1.771338 0.875773
H  -3.985369 1.97696 -0.753396
H  -2.274102 -1.084429 -1.09724
H  -4.049847 -1.414433 -1.346623
H  -3.294376 0.077042 -1.9940
H  -1.661179 1.368569 -1.161853
H  -1.741912 2.63091 0.10606
H  -4.088054 -2.796365 2.122067
H  -3.114533 -2.702718 0.640219
H  -2.567955 -1.883334 2.136582
H  -6.414893 1.877159 -0.982838
H  -5.777232 0.385352 -1.700138
H  -6.557559 0.357343 -0.083752
H  0.488765 2.171133 0.576304
H  2.046518 -1.792966 -1.151097
H  2.450918 1.971995 1.001844
H  4.512674 -2.166759 -0.943841
H  4.865495 1.614412 1.205954
H  6.830769 0.186482 0.733407
H  6.687261 -1.322848 -0.123576
