program: Gaussian 09
title: 000057165
version: EM64L-G09RevD.01
frameworkgroup: C1[X(C6H5Cl3O3)]
method: RPBEPBE
basis: SDD
operation: Freq
keyword: #p
keyword: freq=noraman
keyword: PBEPBE/SDD
title: #p freq=noraman PBEPBE/SDD
converged: YES YES NO NO
title: Mulliken charges:
elementType: Cl Cl Cl O O O C C C C C C H H H H H
charge: 0.075040 0.065248 0.015856 -0.212578 -0.244417 -0.166244 -0.129205 0.699793 -0.432728 -0.757011 0.257603 -0.493667 0.246984 0.359964 0.244659 0.255982 0.214718
chargesum: 0.00000
title: Mulliken charges with hydrogens summed into heavy atoms:
elementType: Cl Cl Cl O O O C C C C C C
charge: 0.075040 0.065248 0.015856 -0.212578 -0.244417 -0.166244 0.117780 0.699793 -0.432728 -0.397047 0.257603 0.221693
polarizability: 1.07905782e+02 6.99467636e-01 1.26634852e+02 -2.23591547e+00 -6.20216934e+00 7.70840584e+01
1716.lowfreq: -7.1383 -3.0481 -0.0023 -0.0015 0.0007 6.0530 18.6593 57.5805 82.6767
frequency: 18.0766 57.5800 82.6759 100.2399 122.5457 130.0644 161.0373 179.2013 215.6566 241.7076 303.5325 313.1246 339.7319 441.3683 491.6763 521.9140 554.7275 634.2256 662.1391 705.7337 717.7838 766.6544 856.8884 899.7333 935.0971 991.3018 1085.1428 1087.8727 1116.2314 1149.0689 1168.0674 1200.1990 1263.6151 1307.0694 1324.1736 1433.0220 1456.0893 1476.9974 1656.8509 1715.5246 2973.9320 2975.7733 3082.5703 3135.0658 3141.5492
redmass: 16.1295 7.8696 5.7953 5.6989 2.0425 15.8543 3.2797 2.8410 12.7332 6.3083 18.7034 6.7237 10.6009 8.5680 9.8839 9.4947 7.6080 8.4044 9.5748 10.1750 8.0364 7.9026 11.5501 6.9615 7.1862 6.4458 4.1735 4.2843 1.3032 1.5252 1.6218 1.2792 1.4344 1.7751 1.3401 1.1445 1.0501 1.0518 10.3689 13.0342 1.0358 1.0827 1.0993 1.0880 1.1033
irintensity: 0.4611 2.3863 3.0683 0.5914 2.5134 1.8920 1.9790 2.4460 1.3934 6.5214 1.5753 4.8982 1.8329 12.8088 9.8700 9.1826 12.0450 87.4301 37.7816 10.0184 79.2352 1.1211 216.3108 18.7217 117.0546 52.2550 86.8622 73.8173 6.3225 31.3008 9.6205 6.2653 30.0153 14.5517 43.1871 5.7436 12.5123 16.6919 37.2150 354.2658 48.1177 28.1984 27.9985 0.1618 13.1116
temp: 298.150 k
press: 1.00000 atm
elementType: 17 17 17 8 8 8 6 6 6 6 6 6 1 1 1 1 1
symmnumber: 1
zpe: 270315.6 jmol-1
zpe.correction: 0.102958 hartree
zpe.thermalcorrener: 0.115696 hartree
zpe.thermalcorrenthalpy: 0.116640 hartree
zpe.thermalcorrgfe: 0.061086 hartree
zpe.sumelectzpe: -1836.538264 hartree
zpe.sumelectthermal: -1836.525526 hartree
zpe.sumelectthermalent: -1836.524582 hartree
zpe.sumelectthermalfe: -1836.580136 hartree
dipole: -0.7947 -4.5501 0.0662
dipole: 4.6195
quadrupole: -93.7263 -89.6474 -89.9490
quadrupole: 15.4184 0.4154 -0.7976
quadrupole: -2.6187 1.4602 1.1585 15.4184 0.4154 -0.7976
hfenergy: -1836.6412222 hartree
pointgroup: C01 [X(C6H5Cl3O3)]
dipole: 0.5055002 -1.6978425 -0.4060362 debye
dipolederiv: -0.279929 0.3842069 0.1425856 0.2014545 -0.3059625 -0.1154973 0.1050632 -0.1521089 -0.0105781 -0.3651118 -0.1164419 0.2821244 -0.0188408 -0.0985171 -0.0468971 0.2131726 0.0321443 -0.4388729 -0.315169 -0.2374609 -0.2290356 -0.0848074 -0.2177797 -0.0610695 -0.1851951 -0.2294044 -0.6658837 -0.6627358 0.1043335 0.1068307 0.2584816 -1.2548854 -0.0721113 0.0827201 -0.2142147 -0.3528086 -0.8520024 0.4463545 -0.0610007 0.3798255 -0.8844527 0.0048261 -0.1777758 0.2399019 -0.410239 -0.5438238 -0.3036228 -0.0310914 -0.1733157 -1.0781575 -0.1095575 0.0186921 -0.1110567 -0.3165731 0.5495258 -0.0395297 0.063131 -0.4527632 1.2183613 -0.0693405 0.241733 -0.3212505 0.5790628 -0.2515658 0.0627147 0.0480292 0.1734032 -0.3047484 -0.0657065 0.1177671 0.1019298 -0.1503478 0.1350957 -0.773423 -0.2356401 -0.6056484 0.3931275 0.1845377 -0.1771826 0.2323382 0.0371868 0.747876 0.4510015 -0.0337749 0.1886751 0.4794138 0.1609644 -0.0696311 0.0885823 1.230997 1.1512165 0.2059106 -0.0380511 0.2776723 1.6875411 0.1991606 -0.10571 0.3005957 0.3716169 0.6282809 -0.3235786 0.0061442 -0.1867098 0.3792426 0.0561744 -0.0779903 0.1357058 0.271912 0.0376814 0.0343662 0.037762 0.049593 -0.0768676 -0.0653266 -0.0490135 -0.0002557 -0.0989576 0.0384079 0.0177027 0.0011378 0.0033838 0.0410241 -0.0136848 0.0129701 -0.0256181 -0.0308791 0.059539 0.0470749 0.0051801 0.0745117 -0.0325048 0.0906948 -0.020142 0.1094978 0.0327241 -0.074947 -0.0057201 -0.0144492 -0.1180001 0.0008984 -0.0246302 0.017593 -0.0514534 0.096038 -0.0023385 0.0461116 -0.0498818 0.0330847 0.054267 -0.0525369 0.0529293 -0.1353335 -0.1443977 unknown
polarizability: 107.9401545|-1.4987681|121.7917035|-4.7717361|15.3157213|81.8928338 unknown
InChI: InChI=1S/C6H5Cl3O3/c1-11-6-2(4(8)9)3(7)5(10)12-6/h4,6H,1H3
charge 0 multiplicity 1
17 atoms
Cl -1.71293 2.233138 0.668528
Cl -2.79853 -0.97509 1.266204
Cl -2.356482 -1.322777 -1.759583
O  1.795928 0.592817 -0.408854
O  1.381817 -1.667326 0.375357
O  1.408519 2.826915 0.18589
C  0.94373 -0.640984 -0.507273
C  -0.455997 -0.195034 -0.089394
C  -0.413833 1.138194 0.177603
C  -1.522303 -1.228381 -0.053051
C  0.981717 1.681097 0.016855
C  2.704721 -2.231497 0.02218
H  1.012291 -0.949775 -1.571947
H  -1.105479 -2.229778 0.108374
H  2.86289 -3.06192 0.724586
H  3.48955 -1.466371 0.146556
H  2.70249 -2.608028 -1.019933
