program: Gaussian 09
title: 000006605
version: EM64L-G09RevD.01
frameworkgroup: C1[X(C23H28Cl2O5)]
method: RPBEPBE
basis: SDD
operation: Freq
keyword: #p
keyword: freq=noraman
keyword: PBEPBE/SDD
title: #p freq=noraman PBEPBE/SDD
converged: NO YES NO NO
title: Mulliken charges:
elementType: Cl Cl O O O O O C C C C C C C C C C C C C C C C C C C C C C C H H H H H H H H H H H H H H H H H H H H H H H H H H H H
charge: -0.030716 -0.028544 -0.444311 -0.188120 -0.229022 -0.247950 -0.257257 0.346610 -0.081850 -0.129464 -0.064359 0.121414 -0.492864 -0.554913 -0.565055 0.116027 -0.548693 -0.468349 -0.827962 -0.662746 0.624126 0.122778 -0.778317 -0.115524 -0.646580 -0.405271 -0.411720 0.181652 0.329136 -0.757262 0.278220 0.214569 0.234268 0.275787 0.222302 0.235774 0.311516 0.279459 0.239973 0.235797 0.250907 0.198258 0.255469 0.266531 0.215104 0.248382 0.261046 0.221287 0.246148 0.254435 0.344120 0.261119 0.265105 0.267137 0.252587 0.260595 0.252945 0.246261
chargesum: 0.00000
title: Mulliken charges with hydrogens summed into heavy atoms:
elementType: Cl Cl O O O O O C C C C C C C C C C C C C C C C C C C C C C C
charge: -0.030716 -0.028544 -0.100191 -0.188120 -0.229022 -0.247950 -0.257257 0.346610 0.196370 0.085105 -0.064359 0.121414 0.017192 -0.096837 -0.253539 0.116027 -0.029261 0.018355 -0.107703 -0.199260 0.624126 0.122778 -0.049835 0.138910 -0.385461 0.126971 -0.159133 0.181652 0.329136 0.002539
polarizability: 3.69793051e+02 -6.99884493e-01 2.45510802e+02 2.15090472e+01 -9.10976521e-01 2.15116256e+02
1716.lowfreq: -19.0499 -7.6916 -6.2427 -0.0008 0.0016 0.0020 13.8622 20.0538 28.0020
frequency: 13.6019 19.9277 27.9119 29.2344 51.1486 61.3585 71.7373 82.1276 91.9694 99.8476 111.6345 145.2338 161.2652 165.9835 168.2006 184.5693 192.8861 195.7724 206.9977 216.2695 225.3788 238.2151 239.6177 254.8374 265.3242 268.2987 278.9945 298.8109 300.3745 312.6324 327.9359 345.1503 351.9414 357.8349 369.4052 397.2955 400.5177 415.8892 436.4556 444.7404 464.0588 480.9852 497.0555 505.3167 518.9543 545.7640 562.5967 568.0419 577.4624 591.4930 614.1749 632.5216 651.3830 672.1646 683.2014 694.6417 743.4132 760.3037 780.1362 788.9198 797.5881 814.9617 825.6955 832.9506 867.3255 882.4047 903.9861 906.1936 910.6972 917.8687 933.3492 936.0456 947.7608 967.4383 977.2159 986.8626 987.5104 995.3382 1001.5945 1011.0969 1015.8367 1021.3066 1033.9060 1034.5519 1044.1000 1064.2447 1088.0376 1095.5630 1104.7497 1112.8649 1126.0513 1130.8963 1153.0045 1164.3559 1168.3818 1175.2616 1180.1153 1201.8308 1208.4819 1213.4478 1218.6647 1227.9919 1233.8223 1244.2491 1249.3787 1253.3322 1277.8295 1282.6097 1292.8272 1297.0341 1303.0813 1316.9863 1326.3640 1327.9295 1337.2809 1342.8345 1348.7326 1351.5582 1366.1997 1378.5510 1386.3341 1391.7084 1404.4663 1426.7772 1452.6285 1453.9134 1457.0551 1463.3550 1464.1184 1467.3756 1475.2721 1479.5736 1481.7731 1482.7703 1496.7981 1560.3559 1616.7079 1618.8745 1639.3065 1666.9890 2946.5175 2958.2661 2987.2592 2990.4239 2993.1561 2994.9698 2998.5502 3001.0922 3007.8879 3021.5109 3044.7538 3051.1648 3057.8574 3062.0466 3065.3570 3076.3135 3079.1043 3088.5700 3090.1722 3095.8098 3101.6086 3104.8100 3115.6774 3128.7270 3142.6660 3143.6091 3181.2270 3522.7448
redmass: 5.9932 5.5472 6.4208 6.7287 1.1079 5.2785 4.3258 5.6025 4.7590 6.2697 5.1017 2.3622 7.2304 3.9752 7.5637 7.2222 3.4426 2.5987 2.6252 3.7411 4.2676 3.3097 1.6113 2.0983 2.8025 3.1284 3.2838 4.3039 3.7338 4.1141 3.5118 3.2569 2.6900 2.7649 1.5221 3.2184 3.7853 3.5629 3.1673 2.9837 4.0774 4.0150 3.7676 3.9252 3.4944 3.8133 3.5606 3.1879 3.2503 3.1594 4.4518 4.9089 3.6731 3.9073 3.6453 3.2934 4.3118 4.0305 4.2481 4.5351 2.1196 1.6309 2.7112 2.0729 3.1659 2.5139 2.2146 2.4448 2.2173 2.1582 2.0671 2.8338 2.1475 1.9973 2.3972 2.2873 2.1168 3.0056 1.4019 2.9295 2.4842 2.5854 2.1318 2.3904 1.6573 2.9204 2.8970 2.2767 2.2430 2.2176 2.1337 2.1213 1.8155 1.5412 1.8967 1.9282 1.5796 2.2683 1.5502 1.3535 1.5467 1.3180 1.7229 1.5373 1.5917 1.6338 1.5905 1.4463 1.4699 1.8740 1.4107 1.4592 1.4005 1.3880 1.4635 1.2914 2.0587 1.4215 1.4090 1.4891 1.2345 1.5280 1.1832 1.0907 1.0596 1.0565 1.0869 1.0728 1.0757 1.0859 1.0623 1.0728 1.0671 1.0645 1.0646 8.5857 8.6435 9.9498 9.3774 7.3767 1.0791 1.0665 1.0768 1.0355 1.0495 1.0527 1.0606 1.0647 1.0385 1.0616 1.0573 1.0940 1.0857 1.1029 1.1003 1.0991 1.0974 1.1005 1.1042 1.0996 1.0938 1.0987 1.1056 1.0918 1.1026 1.0888 1.0947 1.0658
irintensity: 1.8534 1.3585 0.4559 2.5840 0.7279 3.2709 1.1901 1.0119 1.8918 2.0569 0.9286 0.3839 1.3918 1.7869 2.3569 2.3868 0.5092 2.9933 7.0732 4.6504 3.4953 1.0137 3.4233 0.8118 4.0884 2.3094 3.2462 4.4844 3.6974 6.1660 8.6152 0.6210 55.3785 32.9234 114.4298 24.6304 11.7330 7.2999 13.5039 2.9460 7.0198 1.1466 11.8399 0.6120 2.0897 5.0045 1.8745 6.3252 8.6481 0.9615 0.2151 1.8530 6.4211 20.2974 6.3735 7.1890 20.1217 28.6444 40.9786 13.9797 8.2916 28.5318 6.2475 5.6604 2.0496 27.9417 27.1329 63.4423 19.6942 17.2071 4.1782 20.1469 9.3068 3.5553 7.4974 3.6336 2.7962 17.0172 5.2379 23.4395 37.4862 23.2268 7.5607 9.8170 10.6798 1.5068 2.6532 9.7353 10.1358 1.6531 2.9668 6.6773 3.5992 12.8460 2.8465 19.2255 6.8173 111.7243 20.5015 7.3384 2.9233 71.8125 17.1700 7.5901 11.4137 52.7694 2.8731 5.1550 9.0847 18.7590 9.4199 8.0905 4.8050 5.2505 37.0848 1.8326 1.2654 2.2566 3.6498 14.2026 54.3961 16.8926 35.6633 24.9292 26.8621 17.9030 6.5469 2.8313 19.1011 7.1694 3.0158 8.5282 20.6344 5.5907 11.1304 192.1609 10.0073 97.0178 151.8614 132.7104 8.4687 23.3714 4.4004 21.9395 18.2975 2.3841 29.2677 37.5515 0.8007 12.9548 10.3036 28.2096 3.2716 23.1689 16.1043 18.2535 36.5166 17.5969 10.7890 20.1764 8.0628 5.9964 4.5476 9.8765 5.6953 3.4151 16.5570 8.6997
temp: 298.150 k
press: 1.00000 atm
elementType: 17 17 8 8 8 8 8 6 6 6 6 6 6 6 6 6 6 6 6 6 6 6 6 6 6 6 6 6 6 6 1 1 1 1 1 1 1 1 1 1 1 1 1 1 1 1 1 1 1 1 1 1 1 1 1 1 1 1
symmnumber: 1
zpe: 1219090.7 jmol-1
zpe.correction: 0.464327 hartree
zpe.thermalcorrener: 0.494363 hartree
zpe.thermalcorrenthalpy: 0.495307 hartree
zpe.thermalcorrgfe: 0.402534 hartree
zpe.sumelectzpe: -2187.200116 hartree
zpe.sumelectthermal: -2187.170080 hartree
zpe.sumelectthermalent: -2187.169136 hartree
zpe.sumelectthermalfe: -2187.261908 hartree
dipole: 7.6293 -2.3851 2.9206
dipole: 8.5103
quadrupole: -228.9138 -190.2740 -188.7103
quadrupole: -0.2603 -14.2971 -1.0212
quadrupole: -26.2812 12.3587 13.9224 -0.2603 -14.2971 -1.0212
hfenergy: -2187.6644428 hartree
pointgroup: C01 [X(C23H28Cl2O5)]
dipole: -3.0004551 0.7721808 1.269468 debye
polarizability: 369.9318556|1.7902893|244.5211205|-20.9252214|5.535199|215.9671328 unknown
InChI: InChI=1S/C23H28Cl2O5/c1-13(26)30-12-19(28)22(29)9-7-16-17-5-4-14-10-15(27)6-8-20(14,2)23(17,25)18(24)11-21(16,22)3/h6,8,10,16-18,29H,4-5,7,9,11-12H2,1-3H3
charge 0 multiplicity 1
58 atoms
Cl 2.245918 -0.137238 -1.877994
Cl 1.576453 -3.204975 -0.374986
O  -2.233868 0.244308 -2.339875
O  -3.753258 -1.668106 -0.127872
O  -6.239141 -0.415448 -0.666129
O  7.342613 0.240703 -0.581985
O  -5.459273 0.761378 1.180744
C  -1.211206 -0.126988 -0.029725
C  -0.290308 1.100146 -0.294246
C  1.060902 1.003586 0.438781
C  1.869362 -0.291097 0.005582
C  -2.467965 0.306315 -0.859386
C  -0.464219 -1.391502 -0.506062
C  -1.218364 2.307242 -0.012524
C  0.907414 -1.504387 0.195646
C  3.303419 -0.364412 0.730684
C  -2.613029 1.828409 -0.542272
C  1.882197 2.300791 0.295975
C  -1.632196 -0.269876 1.463974
C  3.185117 2.214185 1.116719
C  3.990863 1.013348 0.675774
C  -3.742634 -0.539613 -0.681441
C  3.094664 -0.746888 2.247051
C  4.204972 -1.457999 0.166785
C  5.285336 1.167745 0.26315
C  -5.009456 0.013022 -1.369812
C  5.494513 -1.273247 -0.229699
C  6.134322 0.057922 -0.214498
C  -6.332369 0.026663 0.659833
C  -7.570637 -0.516146 1.326562
H  -0.072034 1.105762 -1.381401
H  0.860394 0.872454 1.524895
H  -0.266882 -1.360889 -1.594813
H  -1.042524 -2.303698 -0.280597
H  -0.885908 3.225123 -0.525834
H  -1.266288 2.528855 1.07045
H  0.772702 -1.661624 1.278845
H  -3.417375 2.001302 0.192418
H  -2.884792 2.345113 -1.479117
H  1.269047 3.147524 0.655248
H  2.113974 2.483651 -0.769847
H  -0.766753 -0.206143 2.147233
H  -2.347559 0.51204 1.771512
H  -2.126256 -1.241747 1.622383
H  2.9217 2.135178 2.192664
H  3.784333 3.133974 0.998288
H  4.06466 -0.681751 2.768125
H  2.386597 -0.071558 2.75818
H  2.731734 -1.784756 2.344311
H  3.781148 -2.464439 0.153627
H  -1.933202 -0.67098 -2.583535
H  5.753432 2.160202 0.264667
H  -5.110865 -0.416805 -2.379224
H  -4.977188 1.112266 -1.438433
H  6.107341 -2.112898 -0.577102
H  -7.347704 -1.520753 1.730708
H  -8.394999 -0.619742 0.604349
H  -7.864574 0.137597 2.161147
