program: Gaussian 09
title: 000006479
version: EM64L-G09RevD.01
frameworkgroup: C1[X(C5H6Br2N2O2)]
method: RPBEPBE
basis: SDD
operation: Freq
keyword: #p
keyword: freq=noraman
keyword: PBEPBE/SDD
title: #p freq=noraman PBEPBE/SDD
converged: NO NO NO NO
title: Mulliken charges:
elementType: Br Br O O N N C C C C C H H H H H H
charge: 0.219898 0.263852 -0.181608 -0.190711 -0.525266 -0.541978 0.188771 0.260158 -0.658339 -0.658347 0.371857 0.235177 0.249615 0.241065 0.241062 0.249614 0.235181
chargesum: 0.00000
title: Mulliken charges with hydrogens summed into heavy atoms:
elementType: Br Br O O N N C C C C C
charge: 0.219898 0.263852 -0.181608 -0.190711 -0.525266 -0.541978 0.188771 0.260158 0.067517 0.067510 0.371857
polarizability: 1.57293012e+02 -5.25380610e-01 1.16086003e+02 -9.67936335e-04 -2.37665138e-03 5.42605843e+01
1716.lowfreq: -6.1065 -0.0002 0.0005 0.0008 7.3512 13.4339 51.2258 65.8302 87.3390
frequency: 51.1607 65.8014 87.3225 114.1088 163.6642 170.6479 201.2864 217.3099 234.2909 238.8629 249.5337 290.8112 319.6852 420.8073 466.4248 584.3425 631.9666 666.7410 672.1443 696.0679 810.5358 916.4783 936.2433 998.0824 999.3423 1053.1156 1121.8476 1175.3105 1175.5926 1207.1273 1250.3585 1375.7410 1393.0217 1457.0586 1457.5089 1473.7398 1480.5213 1671.7667 1720.4934 2995.5329 2997.7184 3097.4128 3101.5786 3109.0771 3113.8568
redmass: 5.4367 6.6914 7.2383 17.8593 6.8262 8.2558 1.0648 18.9678 1.2734 3.8878 3.5285 4.6740 3.0930 4.1346 5.4826 6.9409 4.2537 11.6342 7.0436 8.3395 6.2113 2.9201 1.5147 3.1359 1.2857 11.0069 4.4837 4.0365 3.0349 4.8572 5.5335 1.1836 1.1908 1.0480 1.0464 1.0582 1.0529 12.4199 12.7731 1.0344 1.0349 1.1009 1.1003 1.1016 1.1011
irintensity: 4.2992 0.0216 1.1545 0.0676 2.6727 1.8143 0.0211 1.0100 0.4501 0.8764 0.5632 3.8092 0.4463 13.9033 2.7922 9.3230 39.3191 15.8063 53.3053 13.1949 12.4714 41.7458 1.0424 6.6990 0.4846 64.2255 19.5312 14.0035 18.6484 24.8163 84.3837 20.2641 18.1098 5.8584 1.8502 14.0586 19.5801 526.8252 153.4147 9.3487 9.3945 5.6546 14.7142 8.1205 14.1535
temp: 298.150 k
press: 1.00000 atm
elementType: 35 35 8 8 7 7 6 6 6 6 6 1 1 1 1 1 1
symmnumber: 1
zpe: 290884.2 jmol-1
zpe.correction: 0.110792 hartree
zpe.thermalcorrener: 0.123000 hartree
zpe.thermalcorrenthalpy: 0.123945 hartree
zpe.thermalcorrgfe: 0.070201 hartree
zpe.sumelectzpe: -480.132476 hartree
zpe.sumelectthermal: -480.120268 hartree
zpe.sumelectthermalent: -480.119323 hartree
zpe.sumelectthermalfe: -480.173067 hartree
dipole: -2.6293 2.3575 0.0009
dipole: 3.5314
quadrupole: -74.5481 -91.6333 -80.0202
quadrupole: -8.1424 0.0016 0.0014
quadrupole: 7.5191 -9.5661 2.0470 -8.1424 0.0016 0.0014
hfenergy: -480.243268 hartree
pointgroup: C01 [X(C5H6Br2N2O2)]
dipole: -1.2474925 0.6116531 -0.0007489 debye
dipolederiv: -0.3164597 -0.3433023 -0.0000565 -0.3201111 -0.2319412 0.0000361 -0.0001309 -0.0000239 0.1384655 -0.3376548 0.1524448 -0.0004134 0.0155298 0.0888503 0.0000584 -0.0003287 0.000163 0.1679844 -0.4074721 -0.3446419 0.0001848 -0.0810382 -1.1446074 0.0005181 -0.0000029 0.0004894 -0.3178969 -0.493445 0.2576673 -0.0003254 0.4005346 -1.0483699 0.0007901 -0.0002355 0.0004426 -0.3200525 -0.4606473 0.7082676 -0.0003121 0.9864551 -0.0774449 0.0003552 -0.0004874 0.0002263 -0.4760522 0.2725864 -0.0393872 0.0003478 -0.1874421 -1.20161 0.0005149 0.0004874 0.0005956 -0.2625843 -0.1605212 -0.4383544 -0.0001013 -0.1903206 0.3915955 -0.0000393 -0.0002498 -0.000146 0.4042165 0.5210421 0.1591006 0.0000433 -0.3833158 1.5046168 -0.0012061 0.0004389 -0.0009835 0.2093433 -0.0361657 0.075954 -0.0540461 -0.0015873 -0.025065 0.0023972 0.02602 0.0138396 -0.0483711 -0.0362196 0.0760308 0.0539542 -0.0016138 -0.025135 -0.0024144 -0.0260053 -0.0138283 -0.048348 1.338736 -0.2255451 0.0007443 -0.2432846 1.6259951 -0.0010511 0.0005425 -0.0008104 0.3393919 -0.0961407 -0.0231927 -0.0137246 -0.055176 0.0845361 0.0131384 -0.0001909 0.0396808 0.0718589 0.1017862 -0.0324805 -0.0054612 0.0225128 -0.0802603 0.0105633 -0.0238338 -0.0193234 0.0937372 0.0524044 0.0366107 0.0807799 0.0358066 0.0672263 -0.0738531 0.0507321 -0.0459579 -0.0585627 0.0525933 0.0364949 -0.0806352 0.0356584 0.0673354 0.0738216 -0.0506057 0.0458933 -0.0588472 0.1017672 -0.0325834 0.0054925 0.0224905 -0.0802345 -0.0104085 0.02382 0.0194658 0.0937716 -0.0961897 -0.0230833 0.0135292 -0.0550985 0.0845128 -0.0132209 0.00003 -0.039723 0.0719457 unknown
polarizability: 154.5272599|10.3244551|118.8517006|0.054627|-0.0337586|54.2606383 unknown
InChI: InChI=1S/C5H6Br2N2O2/c1-5(2)3(10)8(6)4(11)9(5)7/h1-2H3
charge 0 multiplicity 1
17 atoms
Br -2.316599 -1.984171 -0.00049
Br 3.215045 -0.138799 0.001885
O  0.982707 2.311953 -0.00131
O  0.913424 -2.436273 0.001679
N  -0.813952 -0.775818 -0.000114
N  1.297978 -0.052046 0.000648
C  -0.948344 0.705678 -0.00103
C  0.564682 1.137316 -0.00058
C  -1.629515 1.233455 -1.284424
C  -1.63095 1.234902 1.280942
C  0.488188 -1.26892 0.000966
H  -2.694608 0.941357 -1.285451
H  -1.560646 2.333951 -1.310269
H  -1.149013 0.82268 -2.18835
H  -1.151792 0.824791 2.185887
H  -1.561648 2.3354 1.305854
H  -2.696158 0.943244 1.280856
