program: Gaussian 09
title: 000057024
version: EM64L-G09RevD.01
frameworkgroup: C1[X(C17H19BrFNO)]
method: RPBEPBE
basis: SDD
operation: Freq
keyword: #p
keyword: freq=noraman
keyword: PBEPBE/SDD
title: #p freq=noraman PBEPBE/SDD
converged: YES YES NO NO
title: Mulliken charges:
elementType: Br F O N C C C C C C C C C C C C C C C C C H H H H H H H H H H H H H H H H H H H
charge: 0.000978 -0.203531 -0.295240 -0.093956 -0.283968 0.380293 0.512405 -0.238365 -0.373980 -0.378976 -0.417561 -0.426108 -0.323029 -0.614099 -0.614389 -0.182523 -0.170953 -0.363975 -0.361088 -0.226336 0.311574 0.209291 0.185113 0.223732 0.222595 0.195400 0.247101 0.289354 0.240271 0.259435 0.218808 0.191256 0.226461 0.222159 0.189331 0.229403 0.250152 0.248900 0.256972 0.257095
chargesum: 0.00000
title: Mulliken charges with hydrogens summed into heavy atoms:
elementType: Br F O N C C C C C C C C C C C C C C C C C
charge: 0.000978 -0.203531 -0.295240 -0.093956 -0.074677 0.380293 0.512405 0.170480 0.044016 -0.131875 -0.128207 -0.185837 -0.063594 0.022425 0.026503 0.067629 0.077947 -0.107004 -0.103994 -0.226336 0.311574
polarizability: 2.62561851e+02 -1.94643645e+01 2.10797884e+02 -1.37040323e+01 1.24460434e+01 1.55418301e+02
1716.lowfreq: -7.0979 -4.2434 -1.3940 -0.0002 0.0002 0.0007 13.2959 21.9195 24.1661
frequency: 12.7111 21.8740 24.1312 25.5513 34.7544 42.3389 72.1920 90.5729 116.4954 133.6329 150.8867 176.8553 195.0654 206.9609 212.9450 240.5587 276.4587 292.8517 306.8267 319.7346 359.8310 385.8228 391.3104 406.2390 411.4393 420.7975 460.1210 476.9933 497.3238 533.1727 577.2812 622.9006 624.1285 663.9107 702.1379 731.3591 762.8195 803.5603 807.6610 818.1684 821.8038 830.9746 838.1074 853.2957 875.4481 935.1777 948.9810 961.8396 963.3833 986.5850 995.0370 1005.7120 1024.3619 1034.2095 1036.5927 1060.1493 1064.4863 1088.2930 1093.3694 1102.6638 1109.1460 1138.5367 1155.3249 1167.1147 1177.7795 1186.2031 1196.2362 1210.5130 1243.8532 1265.3285 1266.6186 1281.9194 1288.9030 1297.9137 1305.9105 1338.0840 1369.0529 1384.6355 1387.5509 1392.3361 1408.6182 1420.1245 1442.5650 1461.0280 1468.2025 1469.9873 1474.8898 1476.4864 1485.5947 1488.7139 1491.3153 1580.0807 1596.9005 1602.9923 1608.5976 2850.6353 2859.4946 2882.8494 2903.2987 2941.5152 3019.4960 3020.4299 3026.5809 3050.4812 3079.2640 3084.2163 3126.4877 3131.0782 3146.8741 3160.1521 3169.9943 3173.8177 3176.5475 3184.3543
redmass: 3.8990 4.7175 4.4030 3.0139 5.4753 5.2513 4.0759 2.0229 5.0964 6.3146 4.5561 5.7790 6.9777 1.8424 1.4703 1.3825 6.5613 5.0705 3.6399 5.6054 2.8170 4.6374 4.4552 2.9143 2.9776 2.5078 3.6507 3.6594 3.6837 4.1155 4.0906 6.9356 6.9563 5.5160 4.3514 3.9574 3.6239 2.4773 1.6262 1.3621 1.7068 2.1049 1.3906 2.2074 2.6603 3.5756 1.6304 1.3708 1.4102 1.3518 5.2188 2.8358 4.8276 1.7277 2.3085 2.5030 1.6377 1.5891 1.8943 1.3318 1.3715 1.4467 1.4628 1.4108 1.7723 1.4341 2.0488 2.2569 1.7269 1.6152 2.3755 1.2783 1.2908 1.3335 1.3524 1.4278 4.6827 3.5297 2.6278 2.1431 2.5957 1.1446 1.1626 1.0456 1.0579 2.3704 1.0762 1.0701 1.0582 1.0910 2.5625 7.7739 6.2358 7.4622 6.4063 1.0570 1.0590 1.0681 1.0820 1.0614 1.0901 1.0779 1.0728 1.0939 1.1008 1.1006 1.0901 1.0898 1.0895 1.0896 1.0952 1.0952 1.0964 1.0954
irintensity: 0.0047 0.1004 0.1284 0.3276 0.0101 0.1558 0.0951 1.6363 1.1139 1.1061 2.0375 1.1150 4.1484 1.1830 2.8459 1.7205 1.1938 0.4233 4.1486 0.8114 6.6545 1.9588 11.1372 0.0299 2.9746 0.7397 6.9828 7.5769 18.0888 35.9240 25.8666 1.3570 1.0511 14.5706 4.7143 0.3680 11.2853 46.4646 7.2125 13.6312 22.7753 73.9342 2.6305 14.6304 20.3561 8.3762 2.2819 0.7509 1.0908 0.5528 96.3452 13.8511 70.7696 66.0846 130.1410 19.7065 9.4990 7.8519 5.5333 10.7362 8.4972 2.6180 44.6369 6.1530 6.4952 4.4389 41.6633 24.1407 5.2669 13.2320 16.5908 14.9222 7.8986 8.5021 3.3199 3.5855 4.4604 7.8062 3.5362 3.5909 3.7091 2.7636 4.5009 12.3918 5.2484 105.8356 12.8619 6.3275 13.0501 16.2653 81.1334 2.6422 10.4884 5.1029 31.4254 68.9894 148.5390 131.4464 33.0697 50.8404 7.1167 61.7627 44.7825 34.4418 29.8406 55.6149 9.7471 8.3673 4.0600 2.5883 5.0688 3.8833 2.7892 2.3279
temp: 298.150 k
press: 1.00000 atm
elementType: 35 9 8 7 6 6 6 6 6 6 6 6 6 6 6 6 6 6 6 6 6 1 1 1 1 1 1 1 1 1 1 1 1 1 1 1 1 1 1 1
symmnumber: 1
zpe: 834739.0 jmol-1
zpe.correction: 0.317935 hartree
zpe.thermalcorrener: 0.339223 hartree
zpe.thermalcorrenthalpy: 0.340168 hartree
zpe.thermalcorrgfe: 0.262156 hartree
zpe.sumelectzpe: -900.901111 hartree
zpe.sumelectthermal: -900.879823 hartree
zpe.sumelectthermalent: -900.878879 hartree
zpe.sumelectthermalfe: -900.956891 hartree
dipole: -2.6464 -1.6829 1.2936
dipole: 3.3925
quadrupole: -142.3600 -137.4516 -125.4636
quadrupole: 13.2215 -3.1069 5.9987
quadrupole: -7.2683 -2.3598 9.6281 13.2215 -3.1069 5.9987
hfenergy: -901.2190466 hartree
pointgroup: C01 [X(C17H19Br1F1N1O1)]
dipole: -1.0823792 -0.5062366 0.5946371 debye
polarizability: 252.8042334|-24.6805308|217.2633823|-20.4008886|17.5989877|158.7104198 unknown
InChI: InChI=1S/C17H19BrFNO/c1-20(2)11-12-21-17(13-3-7-15(18)8-4-13)14-5-9-16(19)10-6-14/h3-10,17H,11-12H2,1-2H3
charge 0 multiplicity 1
40 atoms
Br 6.086859 -1.950164 -0.815892
F  -1.031268 5.245543 -0.573596
O  -0.738621 -1.139185 -0.02954
N  -4.338079 -2.143971 0.156989
C  0.189479 -0.22638 0.662948
C  1.609732 -0.64385 0.271664
C  -0.118952 1.238604 0.343865
C  -2.126255 -1.040258 0.451826
C  -2.930039 -2.109623 -0.303012
C  2.712792 0.136682 0.69899
C  1.85062 -1.816117 -0.481973
C  -0.57489 2.118758 1.353835
C  0.020498 1.721319 -0.983102
C  -4.516305 -2.873793 1.429085
C  -5.274082 -2.618395 -0.882214
C  4.03643 -0.242048 0.386532
C  3.169894 -2.206081 -0.810734
C  -0.881753 3.467879 1.060631
C  -0.28504 3.059916 -1.301061
C  4.247408 -1.414262 -0.368725
C  -0.728146 3.903774 -0.265005
H  0.067168 -0.369577 1.762955
H  -2.148394 -1.21255 1.550363
H  -2.547367 -0.037102 0.246255
H  -2.913248 -1.853393 -1.377729
H  -2.416979 -3.09715 -0.193931
H  2.544413 1.055992 1.271964
H  0.999269 -2.416508 -0.811333
H  -0.693661 1.752747 2.381022
H  0.369265 1.039909 -1.766281
H  -3.857907 -2.455515 2.209916
H  -4.29318 -3.967984 1.340863
H  -5.559333 -2.76366 1.775916
H  -6.311721 -2.527252 -0.513058
H  -5.109769 -3.685454 -1.179598
H  -5.179073 -1.991358 -1.786074
H  4.88218 0.36546 0.720702
H  3.349537 -3.111314 -1.397899
H  -1.233501 4.161793 1.829325
H  -0.183279 3.450167 -2.317889
