program: Gaussian 09
title: 000056872
version: EM64L-G09RevD.01
frameworkgroup: C1[X(C22H29ClN2O2)]
method: RPBEPBE
basis: SDD
operation: Freq
keyword: #p
keyword: freq=noraman
keyword: PBEPBE/SDD
title: #p freq=noraman PBEPBE/SDD
converged: YES YES NO NO
title: Mulliken charges:
elementType: Cl O O N N C C C C C C C C C C C C C C C C C C C C C C H H H H H H H H H H H H H H H H H H H H H H H H H H H H H
charge: -0.068967 -0.231413 -0.250289 -0.113728 -0.120185 -0.393533 -0.361090 -0.369026 -0.319020 -0.322075 -0.584317 0.178775 0.507285 -0.675811 -0.675672 -0.410685 -0.410318 -0.379374 -0.237762 -0.231745 -0.239631 0.349437 -0.315312 -0.361320 -0.211051 -0.185500 -0.116213 0.209565 0.205848 0.210374 0.197255 0.269436 0.214268 0.204737 0.190338 0.191674 0.209110 0.270233 0.212133 0.213809 0.230786 0.202595 0.214794 0.217176 0.211236 0.231811 0.231572 0.236567 0.270144 0.224753 0.227438 0.228537 0.247859 0.266795 0.250948 0.256749
chargesum: 0.00000
title: Mulliken charges with hydrogens summed into heavy atoms:
elementType: Cl O O N N C C C C C C C C C C C C C C C C C C C C C C
charge: -0.068967 -0.231413 -0.250289 -0.113728 -0.120185 0.021881 0.046539 0.114679 0.076055 0.078709 -0.101951 0.178775 0.507285 -0.028621 -0.032467 0.052698 -0.173751 -0.109230 -0.013009 -0.004307 -0.011094 0.349437 -0.067453 -0.094525 0.039897 0.071249 -0.116213
polarizability: 3.54608019e+02 -1.33778775e+00 2.50336231e+02 -1.18545108e+01 -9.09274127e+00 2.05556894e+02
1716.lowfreq: -5.6233 -4.4511 -0.0013 -0.0012 0.0009 2.0908 9.0567 15.1362 22.5405
frequency: 3.8046 14.5706 22.3529 27.2017 31.3628 31.9820 43.9933 48.7873 54.6135 70.9506 81.4613 90.9061 99.4780 127.3540 149.4253 169.6647 180.8832 186.8544 203.0113 217.4396 227.3638 244.6740 268.0991 287.1648 296.8133 299.8731 315.3796 338.6244 363.6168 384.0927 402.1742 403.5785 416.6168 433.2945 441.8561 463.7322 472.8365 497.0872 498.9290 513.2884 564.7369 601.4882 618.1001 623.7189 632.1773 663.2527 695.1126 697.7232 706.2585 749.3491 775.0519 783.8927 797.1349 797.5237 798.1085 815.2368 825.5848 831.4318 857.5404 863.9286 910.1744 917.6768 923.1783 935.2373 943.5437 955.4492 975.9785 979.4314 989.2193 990.4830 998.9673 1001.3843 1019.9190 1026.5652 1036.0764 1055.5362 1067.8587 1070.8979 1073.3729 1074.4620 1083.4226 1089.8920 1107.9572 1116.2088 1140.5508 1169.6966 1172.6882 1175.2746 1187.8858 1194.1903 1203.2974 1213.7114 1222.7649 1229.2273 1255.9477 1260.1989 1281.5282 1284.9951 1289.1137 1293.4095 1312.2758 1328.3768 1340.6688 1348.5426 1357.2062 1360.4962 1364.6708 1373.1739 1375.6701 1383.1721 1385.2192 1389.8653 1404.8376 1411.5141 1444.2297 1454.0740 1458.4680 1462.8957 1464.0416 1464.7487 1471.7454 1476.8739 1478.3445 1482.4539 1482.8799 1486.2547 1489.9958 1502.5942 1582.4802 1593.7883 1605.0895 1608.5522 1613.0088 2857.7520 2864.8264 2889.3242 2937.5694 2981.3566 2983.0257 2985.3978 2999.8732 3001.7904 3004.8546 3022.4913 3025.0177 3037.4481 3041.1412 3064.7377 3074.8889 3077.2135 3078.3369 3085.0969 3087.3887 3110.4330 3124.3558 3134.6876 3145.8553 3154.0209 3161.9109 3162.3613 3173.9329 3181.6215
redmass: 3.8509 7.0713 4.0354 4.6435 3.8871 5.1536 3.9323 4.9422 3.7351 5.3060 4.2585 2.0249 2.8859 6.4094 3.8707 5.4090 3.2499 2.6317 1.4370 2.1733 1.8721 4.0262 3.9351 2.0591 2.1052 3.1401 6.9437 2.0992 3.6743 7.0081 2.3497 2.4445 3.0033 2.9575 3.3350 2.5286 4.0415 3.3959 2.7349 4.7677 3.5415 5.4564 6.2043 7.1232 4.3324 4.5171 2.1635 3.4164 1.7610 2.2775 1.5499 2.9318 1.2376 1.2015 1.3056 3.3357 1.5251 3.6299 1.2488 2.4268 2.0036 1.9455 1.3476 1.7667 1.8774 1.3428 2.6335 1.4135 6.1602 3.9845 1.3237 2.0298 2.8379 2.2334 2.9970 2.2550 2.0544 2.5507 1.8993 2.6678 2.1991 1.7128 1.3069 1.9130 1.8619 1.5288 1.1029 1.3985 1.1428 1.8010 1.9861 2.7949 1.5129 1.9823 1.4817 1.5502 1.2254 1.1978 1.2598 1.2085 1.2583 1.2955 1.3963 1.3160 1.3695 1.3411 1.3196 4.7994 1.3597 6.4542 1.2506 1.2390 3.7298 2.3561 2.0946 1.1431 1.2387 1.0759 1.0758 1.0901 1.0642 1.4531 1.2605 1.3638 1.4833 1.0778 1.0819 1.1240 7.3359 6.0719 6.6992 8.0935 6.0512 1.0721 1.0715 1.0709 1.0560 1.0359 1.0356 1.0610 1.0910 1.0652 1.0692 1.0878 1.0917 1.0877 1.0957 1.1038 1.0982 1.0999 1.0984 1.1001 1.1005 1.0878 1.0862 1.0915 1.0962 1.0877 1.0886 1.1014 1.0966 1.0978
irintensity: 0.1591 0.0385 0.2136 0.2219 0.1538 0.3411 0.2460 0.0963 0.4474 0.5554 2.6151 0.3282 1.1172 0.4669 4.4326 1.0656 1.8704 7.7495 1.3516 0.1055 0.3750 5.3960 2.1907 4.3261 0.0709 0.0520 1.7343 1.6397 7.9246 8.1243 2.9615 3.1046 0.1127 3.9463 6.8652 4.5692 1.8125 15.1070 20.7915 4.4887 1.2696 8.0061 0.5641 0.4978 32.8148 32.6407 12.6310 0.5271 59.7222 28.5169 7.5085 5.0616 14.0261 6.4648 17.3322 7.7591 65.0612 7.2862 0.3367 8.9862 2.7193 2.1818 0.0407 1.4215 11.8628 0.4061 31.4118 1.5292 0.3117 34.5067 0.7047 11.3532 70.0073 8.3101 21.7535 9.7283 6.6051 39.6975 31.6004 23.5371 2.6473 24.3360 14.2320 18.9815 39.6015 78.8316 14.5482 22.5093 6.0158 37.3344 140.9853 7.4582 147.4189 92.2566 14.9164 39.6114 5.9412 4.9850 0.1791 12.2451 2.8759 7.4794 1.5881 9.8324 9.5443 7.6992 2.7873 21.7494 0.8116 8.7759 19.0245 16.0897 8.8117 101.7980 4.6138 62.7349 70.7144 5.3902 11.0047 4.1137 5.1667 92.8804 60.8186 33.4883 3.2981 15.2689 15.7528 8.5196 13.7018 5.3296 78.5691 236.0757 3.9301 28.5775 153.3689 155.7403 48.9309 23.7857 27.8749 29.7759 46.3346 28.1710 10.1413 3.8089 26.6028 7.9128 34.4233 43.5172 52.3871 4.0064 56.8938 65.8947 42.3334 8.3636 0.2267 13.7235 27.8228 14.0962 2.2313 27.0456 8.3801 0.8511
temp: 298.150 k
press: 1.00000 atm
elementType: 17 8 8 7 7 6 6 6 6 6 6 6 6 6 6 6 6 6 6 6 6 6 6 6 6 6 6 1 1 1 1 1 1 1 1 1 1 1 1 1 1 1 1 1 1 1 1 1 1 1 1 1 1 1 1 1
symmnumber: 1
zpe: 1221667.4 jmol-1
zpe.correction: 0.465309 hartree
zpe.thermalcorrener: 0.493506 hartree
zpe.thermalcorrenthalpy: 0.494450 hartree
zpe.thermalcorrgfe: 0.399602 hartree
zpe.sumelectzpe: -1573.687323 hartree
zpe.sumelectthermal: -1573.659126 hartree
zpe.sumelectthermalent: -1573.658182 hartree
zpe.sumelectthermalfe: -1573.753030 hartree
dipole: -5.4900 -4.6206 1.7781
dipole: 7.3927
quadrupole: -182.2144 -167.4104 -169.4977
quadrupole: 9.4188 -3.7941 6.2325
quadrupole: -9.1735 5.6304 3.5431 9.4188 -3.7941 6.2325
hfenergy: -1574.1526319 hartree
pointgroup: C01 [X(C22H29Cl1N2O2)]
dipole: 2.2245514 -1.7564224 -0.6524563 debye
polarizability: 351.5876102|6.1990359|252.1824156|-23.2567895|2.5020357|206.7311191 unknown
InChI: InChI=1S/C22H29ClN2O2/c1-3-24(4-2)15-8-16-25(17-19-9-6-5-7-10-19)22(26)18-27-21-13-11-20(23)12-14-21/h5-7,9-14H,3-4,8,15-18H2,1-2H3
charge 0 multiplicity 1
56 atoms
Cl -8.299485 -1.887178 -0.147427
O  -2.971202 0.699365 0.990198
O  -0.790968 2.236707 1.362231
N  3.367928 -2.726031 0.14536
N  0.690997 0.580474 0.653915
C  1.198251 -1.871271 1.088664
C  1.951174 -3.066022 0.456382
C  0.995323 -0.73714 0.053853
C  3.890526 -3.432804 -1.058424
C  4.250473 -2.897009 1.335672
C  1.861402 1.420755 1.032318
C  -0.583838 1.089694 0.868907
C  2.516069 2.091912 -0.170778
C  3.350309 -2.855912 -2.380538
C  5.528414 -2.039241 1.278234
C  -1.739451 0.163996 0.4281
C  3.723547 1.589915 -0.717308
C  1.907361 3.226487 -0.76934
C  4.31668 2.208417 -1.842549
C  2.498077 3.844359 -1.892899
C  3.704835 3.337351 -2.432961
C  -4.162377 0.032043 0.668513
C  -4.254506 -1.123962 -0.147576
C  -5.332904 0.600805 1.232408
C  -5.520058 -1.707018 -0.395257
C  -6.590938 0.020299 0.986575
C  -6.667843 -1.130574 0.173129
H  1.778717 -1.479478 1.945635
H  0.226399 -2.214891 1.495729
H  1.883572 -3.952676 1.131949
H  1.442588 -3.352665 -0.483527
H  1.935335 -0.635899 -0.518396
H  0.21199 -1.015791 -0.674592
H  4.990254 -3.326085 -1.056179
H  3.679736 -4.531137 -1.007568
H  4.524092 -3.97299 1.480275
H  3.670164 -2.60302 2.230259
H  1.48665 2.176152 1.743657
H  2.590972 0.771326 1.551702
H  3.807132 -3.377653 -3.241886
H  3.588995 -1.780015 -2.452883
H  2.254247 -2.969412 -2.469219
H  6.135582 -2.1940 2.189337
H  5.269838 -0.967633 1.208206
H  6.161207 -2.294034 0.409176
H  -1.576269 -0.872814 0.785926
H  -1.795256 0.149707 -0.682317
H  4.200691 0.712318 -0.261729
H  0.974549 3.616874 -0.345297
H  5.252616 1.813686 -2.25435
H  2.023456 4.722882 -2.344491
H  4.164129 3.820611 -3.302783
H  -3.367913 -1.582051 -0.594814
H  -5.233386 1.494027 1.855511
H  -5.601639 -2.598616 -1.023658
H  -7.496142 0.45576 1.418925
