program: Orca
programVersion: 5.0.2
elementType: S F F F O O O O N N N N C C C C C C C C C C C C C C C C H H H H H H H H H H H
charge: 0
multiplicity: 1
keywords: wb97x-d3
keywords: def2-TZVPP
keywords: def2/J RIJCOSX
keywords: DEFGRID2
keywords: scfconv7
keywords: smallprint printgap noloewdin
keywords: NOSOSCF
formula: C16H11F3N4O4S
InChI: InChI=1/C16H11F3N4O4S/c1-4-5-22-10-7-9(8(17)6-11(10)27-16(18,19)12(22)24)23-13(25)20(2)15(28)21(3)14(23)26/h1,6-7H,5H2,2-3H3
39 atoms
S  6.05438 0.540111 0.205249
F  0.87196 -2.756111 0.472204
F  -4.520298 -0.506606 1.784539
F  -5.715578 -0.991247 0.048683
O  -3.624792 -1.511476 0.018662
O  1.924374 -1.100033 -1.89116
O  1.581505 0.692308 2.231481
O  -5.17759 1.561387 -0.382063
N  1.741587 -0.191146 0.16243
N  -2.941721 1.153584 -0.211797
N  3.823163 -0.367404 -0.865281
N  3.619384 0.696802 1.207765
C  -1.94116 0.18595 -0.021229
C  0.354336 -0.496157 0.163733
C  -2.309047 -1.15172 0.098148
C  -0.590632 0.501771 0.003651
C  -0.049845 -1.810073 0.307237
C  -1.381562 -2.156475 0.274434
C  2.467451 -0.588257 -0.942466
C  2.271988 0.418961 1.279788
C  -4.251224 0.832734 -0.111852
C  -4.517698 -0.573146 0.435673
C  -2.579126 2.498285 -0.646478
C  4.430194 0.27754 0.182837
C  4.649458 -0.83102 -1.978129
C  4.221525 1.419076 2.326378
C  -2.085691 2.516805 -2.016268
C  -1.672603 2.541024 -3.142787
H  -0.246131 1.520385 -0.107086
H  -1.695838 -3.186883 0.377116
H  -3.45503 3.136751 -0.553658
H  -1.834144 2.91045 0.034766
H  5.418229 -1.504406 -1.611062
H  5.120794 0.012203 -2.475582
H  4.026258 -1.359606 -2.68778
H  3.438096 1.778812 2.980989
H  4.784634 2.26782 1.951247
H  4.88753 0.768522 2.887094
H  -1.307648 2.562349 -4.14546
elementType: S F O N C H
totalener: -1834.12963049 hartree
nucrepener: 2880.50953511 hartree
electener: -4714.63916560 hartree
oneelecener: -8244.52791949 hartree
twoeener: 3529.88875389 hartree
cpcmener: -0.04856395 hartree
kineticenergy: 1828.05896490 hartree
xcener: -147.968322271659 hartree
chargesum: -0.0000000
charge: -0.363372 -0.205141 -0.178415 -0.164022 -0.268744 -0.465042 -0.464696 -0.454693 -0.080314 -0.045294 -0.077374 -0.080683 0.077289 -0.070570 0.215080 -0.101644 0.258672 -0.178246 0.425326 0.424178 0.270709 0.462886 -0.075569 0.179837 -0.151137 -0.154718 -0.443380 0.097757 0.155367 0.150629 0.138570 0.153464 0.119125 0.122415 0.120133 0.119873 0.118423 0.125442 0.287878
qa: -0.3634 -0.2051 -0.1784 -0.1640 -0.2687 -0.4650 -0.4647 -0.4547 -0.0803 -0.0453 -0.0774 -0.0807 0.0773 -0.0706 0.2151 -0.1016 0.2587 -0.1782 0.4253 0.4242 0.2707 0.4629 -0.0756 0.1798 -0.1511 -0.1547 -0.4434 0.0978 0.1554 0.1506 0.1386 0.1535 0.1191 0.1224 0.1201 0.1199 0.1184 0.1254 0.2879
va: 2.0524 1.0956 1.1153 1.1519 2.1549 2.0561 2.0554 2.0607 3.1605 3.3008 3.3269 3.3230 3.9500 3.6542 3.8673 3.9596 4.1037 4.0021 4.2160 4.2225 4.1774 4.4216 3.8596 4.2837 3.8334 3.8357 3.7816 3.5677 1.0076 1.0091 1.0166 0.9820 1.0029 1.0012 1.0205 1.0190 1.0040 0.9998 0.9455
dispcorr: -0.020432355 hartree
energy: -1834.150062844298
dipole: 26.36695 -24.29921 2.06774 12.26664 -11.51304 0.75361 -5.37973 5.20164 -0.17809
magnitude: 2.20799 au
magnitude: 5.61225 debye
