program: Orca
programVersion: 5.0.2
elementType: Cl Cl S F F O O O N N N N C C C C C C C C C C C H H H H H H H H H H
charge: 0
multiplicity: 1
keywords: wb97x-d3
keywords: def2-TZVPP
keywords: def2/J RIJCOSX
keywords: DEFGRID2
keywords: scfconv7
keywords: smallprint printgap noloewdin
keywords: NOSOSCF
formula: C11H10Cl2F2N4O3S
InChI: InChI=1/C11H10Cl2F2N4O3S/c1-5-16-19(11(20)18(5)10(14)15)9-4-8(17-23(2,21)22)6(12)3-7(9)13/h3-4,10,17H,1-2H3
33 atoms
Cl -0.977424 3.058915 -0.060099
Cl 4.15993 1.551349 -0.184577
S  3.35606 -2.186173 1.134514
F  -5.738989 0.418595 -0.896209
F  -5.279578 -1.694437 -0.839597
O  -2.115118 0.104235 -2.251211
O  2.071035 -2.642106 1.638907
O  4.351022 -3.157538 0.714848
N  -1.552713 0.155082 0.000754
N  -3.603274 -0.218242 -0.466358
N  -2.201368 0.034326 1.198375
N  3.057138 -1.25488 -0.218923
C  -0.188863 0.484587 -0.062575
C  -2.378324 0.026783 -1.067396
C  -3.4297 -0.196217 0.906835
C  2.114197 -0.214141 -0.157482
C  0.759928 -0.517781 -0.119613
C  0.208119 1.817081 -0.088446
C  2.489936 1.129792 -0.157696
C  1.549784 2.146058 -0.141538
C  -4.785825 -0.488956 -1.196501
C  -4.502203 -0.400593 1.901661
C  4.0716 -1.096646 2.337769
H  0.436854 -1.548389 -0.151126
H  3.905647 -1.057517 -0.742927
H  1.863667 3.180287 -0.157887
H  -4.584677 -0.473108 -2.265522
H  -5.286055 0.349187 1.800088
H  -4.079282 -0.32024 2.899685
H  -4.958534 -1.384578 1.801839
H  3.379513 -0.284692 2.554234
H  4.248189 -1.672368 3.245853
H  5.01414 -0.706806 1.960594
elementType: Cl S F O N C H
totalener: -2388.34111095 hartree
nucrepener: 2513.79086545 hartree
electener: -4902.13197639 hartree
oneelecener: -8286.82807907 hartree
twoeener: 3384.69610268 hartree
cpcmener: -0.04879212 hartree
kineticenergy: 2382.03699779 hartree
xcener: -157.442594319328 hartree
chargesum: 0.0000000
charge: -0.044060 -0.053793 0.866679 -0.204255 -0.205220 -0.525125 -0.529094 -0.540416 0.009294 -0.142999 -0.280415 -0.227206 0.084460 0.405906 0.204512 0.161911 -0.149056 -0.046348 -0.003934 -0.045961 0.399530 -0.248838 -0.256676 0.143700 0.182003 0.132325 0.129981 0.121112 0.106481 0.120651 0.147247 0.151120 0.136482
qa: -0.0441 -0.0538 0.8667 -0.2043 -0.2052 -0.5251 -0.5291 -0.5404 0.0093 -0.1430 -0.2804 -0.2272 0.0845 0.4059 0.2045 0.1619 -0.1491 -0.0463 -0.0039 -0.0460 0.3995 -0.2488 -0.2567 0.1437 0.1820 0.1323 0.1300 0.1211 0.1065 0.1207 0.1472 0.1511 0.1365
va: 1.2781 1.2708 5.7512 1.0800 1.0799 1.9941 1.9358 1.9375 3.1639 3.2494 2.9031 3.0512 3.6963 4.2996 4.0086 3.7487 4.1810 4.1293 4.0579 3.9809 4.1717 3.9246 3.8827 1.0371 1.0300 1.0167 0.9986 1.0003 1.0136 1.0012 0.9964 1.0113 1.0097
dispcorr: -0.019120821 hartree
energy: -2388.360231768700
dipole: 6.19467 -5.87598 0.31870 -8.56329 10.50057 1.93728 11.66605 -10.42315 1.24290
magnitude: 2.32367 au
magnitude: 5.90629 debye
