program: Orca
programVersion: 5.0.2
elementType: Cl S F F F F O O O O O N N N N C C C C C C C C C C C C C C C C C H H H H H H H H H H H H H H H H H
charge: 0
multiplicity: 1
keywords: wb97x-d3
keywords: def2-TZVPP
keywords: def2/J RIJCOSX
keywords: DEFGRID2
keywords: scfconv7
keywords: smallprint printgap noloewdin
keywords: NOSOSCF
formula: C17H17ClF4N4O5S
InChI: InChI=1/C17H17ClF4N4O5S/c1-8(2)25(4)32(30,31)23-15(28)9-5-12(11(19)6-10(9)18)26-14(27)7-13(17(20,21)22)24(3)16(26)29/h5-8,23H,1-4H3
49 atoms
Cl -3.32148 2.649203 0.407898
S  -3.528332 -2.561444 -0.417673
F  1.571593 3.278381 1.245322
F  6.436439 -1.611625 1.011089
F  6.636045 -0.890647 -0.990142
F  7.140752 0.3853 0.677654
O  -3.106358 -3.583353 0.518327
O  -3.423602 -2.793435 -1.841035
O  -3.211969 0.20974 -1.543128
O  2.714296 2.113746 -1.457215
O  1.858069 -0.501759 2.135034
N  -5.026831 -2.087171 -0.068647
N  -2.474833 -1.292709 -0.015458
N  2.292428 0.802029 0.330781
N  4.453213 0.93707 -0.585085
C  -5.955384 -1.586772 -1.110164
C  -6.528542 -0.225511 -0.745301
C  -7.053087 -2.612014 -1.34393
C  -5.355141 -1.84104 1.330337
C  0.941228 1.236292 0.30831
C  -1.389407 0.826576 -0.140417
C  -2.450115 -0.089945 -0.650526
C  -0.06525 0.408326 -0.14916
C  3.133731 1.334195 -0.630488
C  4.853059 -0.033907 0.300057
C  2.660893 -0.115445 1.309704
C  0.60612 2.490263 0.786861
C  4.028884 -0.55219 1.223282
C  -1.690493 2.100629 0.333952
C  -0.69688 2.941063 0.804945
C  5.33419 1.559432 -1.580229
C  6.281664 -0.539594 0.244263
H  -5.389164 -1.4722 -2.031342
H  -7.07932 0.162015 -1.602377
H  -7.22754 -0.282127 0.089683
H  -5.753712 0.498349 -0.49573
H  -6.640254 -3.561386 -1.684326
H  -7.743737 -2.253171 -2.107731
H  -7.629293 -2.794034 -0.435068
H  -6.418269 -2.020637 1.475494
H  -5.125191 -0.818988 1.63452
H  -4.826373 -2.529712 1.983506
H  -1.861283 -1.463218 0.77536
H  0.190455 -0.574078 -0.525987
H  4.349291 -1.309003 1.920936
H  -0.925131 3.925014 1.192028
H  5.324264 1.005256 -2.51574
H  6.346561 1.642382 -1.206966
H  4.99034 2.569922 -1.767165
elementType: Cl S F O N C H
totalener: -2511.22653384 hartree
nucrepener: 3837.96595234 hartree
electener: -6349.19248618 hartree
twoeener: 4741.13672192 hartree
cpcmener: -0.06334069 hartree
kineticenergy: 2503.30403552 hartree
xcener: -187.677538999555 hartree
chargesum: -0.0000000
charge: -0.049053 0.865944 -0.198284 -0.158471 -0.160735 -0.161019 -0.526491 -0.509127 -0.449882 -0.489743 -0.490279 -0.138335 -0.166078 -0.068430 -0.097547 0.055653 -0.253996 -0.259221 -0.195207 -0.024184 0.058091 0.291076 -0.124581 0.433975 0.018509 0.370491 0.268212 -0.152307 0.086496 -0.157602 -0.183791 0.534483 0.074413 0.105656 0.094239 0.086816 0.090431 0.094788 0.088859 0.122275 0.113169 0.129355 0.207178 0.159332 0.138939 0.139780 0.142297 0.127835 0.116071
qa: -0.0491 0.8659 -0.1983 -0.1585 -0.1607 -0.1610 -0.5265 -0.5091 -0.4499 -0.4897 -0.4903 -0.1383 -0.1661 -0.0684 -0.0975 0.0557 -0.2540 -0.2592 -0.1952 -0.0242 0.0581 0.2911 -0.1246 0.4340 0.0185 0.3705 0.2682 -0.1523 0.0865 -0.1576 -0.1838 0.5345 0.0744 0.1057 0.0942 0.0868 0.0904 0.0948 0.0889 0.1223 0.1132 0.1294 0.2072 0.1593 0.1389 0.1398 0.1423 0.1278 0.1161
va: 1.2682 6.0463 1.1057 1.1524 1.1515 1.1456 1.9671 1.9740 2.0518 2.0251 2.0146 3.0243 3.1355 3.1321 3.3802 3.8855 3.8877 3.9441 3.9069 3.6115 3.6196 4.2023 4.0513 4.2056 3.9742 4.1822 4.1197 3.8910 3.9035 4.0312 3.8602 4.4228 1.0289 1.0049 0.9993 1.0142 1.0126 1.0040 1.0056 0.9918 0.9891 1.0101 1.0024 1.0142 1.0216 1.0134 0.9875 1.0083 1.0080
dispcorr: -0.029163111 hartree
energy: -2511.255696947546
dipole: -58.39714 59.62475 1.22762 -13.16811 14.39098 1.22287 -7.26536 8.59249 1.32712
magnitude: 2.18259 au
magnitude: 5.54771 debye
