program: Orca
programVersion: 5.0.2
elementType: Cl S F F F F O O O O O N N N N C C C C C C C C C C C C C C C C C H H H H H H H H H H H H H H H H H
charge: 0
multiplicity: 1
keywords: wb97x-d3
keywords: def2-TZVPP
keywords: def2/J RIJCOSX
keywords: DEFGRID2
keywords: scfconv7
keywords: smallprint printgap noloewdin
keywords: NOSOSCF
formula: C17H17ClF4N4O5S
InChI: InChI=1/C17H17ClF4N4O5S/c1-8(2)25(4)32(30,31)23-15(28)9-5-12(11(19)6-10(9)18)26-14(27)7-13(17(20,21)22)24(3)16(26)29/h5-8,23H,1-4H3
49 atoms
Cl -3.367885 2.743059 0.543164
S  -3.372721 -2.526952 -0.517794
F  1.55818 3.600835 0.324151
F  6.91131 -0.033803 1.40492
F  6.377697 -1.687671 0.159516
F  6.890496 0.213742 -0.723309
O  -3.072829 -3.253589 0.695672
O  -2.96377 -3.061717 -1.800464
O  -3.300639 -0.284301 1.497864
O  1.971319 0.164964 -1.696901
O  2.537374 1.735502 2.508253
N  -4.947933 -2.184347 -0.549771
N  -2.499584 -1.067969 -0.471627
N  2.261934 0.939245 0.404708
N  3.997238 -0.181412 -0.716731
C  -5.492271 -1.486716 -1.736268
C  -5.84383 -0.037947 -1.435663
C  -6.680715 -2.254019 -2.29431
C  -5.74032 -2.165491 0.674295
C  0.905217 1.357785 0.421116
C  -1.445873 0.834899 0.506731
C  -2.51188 -0.207212 0.582052
C  -0.119088 0.431466 0.466437
C  2.703074 0.296063 -0.741095
C  4.810262 0.072381 0.361552
C  3.023608 1.17972 1.543982
C  0.582351 2.703225 0.399868
C  4.384172 0.721137 1.455184
C  -1.735334 2.196349 0.513376
C  -0.725462 3.140266 0.45354
C  4.434368 -0.966668 -1.877493
C  6.259886 -0.368181 0.297624
H  -4.714857 -1.490675 -2.500233
H  -4.993225 0.515751 -1.038122
H  -6.151452 0.452291 -2.359202
H  -6.671175 0.047289 -0.730465
H  -6.416833 -3.286365 -2.521679
H  -7.012496 -1.781721 -3.218826
H  -7.527821 -2.256554 -1.607543
H  -5.85943 -1.163163 1.080503
H  -5.2977 -2.799867 1.434317
H  -6.724503 -2.572226 0.450593
H  -1.840388 -0.927266 -1.231216
H  0.125085 -0.623267 0.485927
H  5.029183 0.920658 2.29561
H  -0.942895 4.199789 0.437735
H  4.739681 -1.962452 -1.573185
H  5.235876 -0.467805 -2.413574
H  3.599508 -1.074667 -2.556292
elementType: Cl S F O N C H
totalener: -2511.22627097 hartree
nucrepener: 3851.35752803 hartree
electener: -6362.58379900 hartree
twoeener: 4754.33021254 hartree
cpcmener: -0.06251549 hartree
kineticenergy: 2503.30567248 hartree
xcener: -187.678569143864 hartree
chargesum: 0.0000000
charge: -0.048931 0.861403 -0.196897 -0.159293 -0.160740 -0.161121 -0.507542 -0.523575 -0.445918 -0.486826 -0.488216 -0.135534 -0.161767 -0.070225 -0.087938 0.066790 -0.267267 -0.265932 -0.193967 0.003316 0.080725 0.265267 -0.130478 0.417395 0.016742 0.374231 0.251353 -0.152315 0.064641 -0.143953 -0.204595 0.538670 0.079558 0.079441 0.105644 0.096672 0.096490 0.098353 0.091223 0.108497 0.128565 0.122851 0.207306 0.158030 0.139884 0.140883 0.141937 0.141939 0.115223
qa: -0.0489 0.8614 -0.1969 -0.1593 -0.1607 -0.1611 -0.5075 -0.5236 -0.4459 -0.4868 -0.4882 -0.1355 -0.1618 -0.0702 -0.0879 0.0668 -0.2673 -0.2659 -0.1940 0.0033 0.0807 0.2653 -0.1305 0.4174 0.0167 0.3742 0.2514 -0.1523 0.0646 -0.1440 -0.2046 0.5387 0.0796 0.0794 0.1056 0.0967 0.0965 0.0984 0.0912 0.1085 0.1286 0.1229 0.2073 0.1580 0.1399 0.1409 0.1419 0.1419 0.1152
va: 1.2699 6.0327 1.1078 1.1522 1.1488 1.1473 1.9819 1.9589 2.0518 2.0288 2.0214 3.0267 3.1180 3.1382 3.3571 3.9114 3.9199 3.9227 3.9174 3.6104 3.5983 4.2108 4.0259 4.2217 3.9855 4.1791 4.1298 3.8894 3.9194 4.0134 3.8363 4.4097 1.0185 1.0127 1.0076 0.9978 1.0119 1.0032 1.0026 0.9903 1.0094 0.9903 1.0020 1.0156 1.0201 1.0121 0.9941 0.9940 1.0244
dispcorr: -0.029367536 hartree
energy: -2511.255638509242
dipole: -58.37831 59.13263 0.75432 -18.95170 19.57672 0.62501 -16.49132 14.18639 -2.30492
magnitude: 2.50446 au
magnitude: 6.36582 debye
