program: Orca
programVersion: 5.0.2
elementType: Cl S F F F F O O O O O N N N N C C C C C C C C C C C C C C C C C H H H H H H H H H H H H H H H H H
charge: 0
multiplicity: 1
keywords: wb97x-d3
keywords: def2-TZVPP
keywords: def2/J RIJCOSX
keywords: DEFGRID2
keywords: scfconv7
keywords: smallprint printgap noloewdin
keywords: NOSOSCF
formula: C17H17ClF4N4O5S
InChI: InChI=1/C17H17ClF4N4O5S/c1-8(2)25(4)32(30,31)23-15(28)9-5-12(11(19)6-10(9)18)26-14(27)7-13(17(20,21)22)24(3)16(26)29/h5-8,23H,1-4H3
49 atoms
Cl -3.186975 3.432597 0.421175
S  -4.105271 -1.881251 0.756605
F  1.805784 3.478669 0.431664
F  6.686778 -0.371182 1.354941
F  6.113345 -1.980658 0.063335
F  6.688285 -0.069582 -0.764423
O  -5.356691 -1.210405 1.032145
O  -3.618908 -2.88908 1.677828
O  -3.707813 0.680742 -0.71369
O  1.946183 0.475516 -1.886843
O  2.236179 1.155399 2.576361
N  -4.135022 -2.450581 -0.747642
N  -2.858442 -0.734993 0.830178
N  2.087158 0.777372 0.347262
N  3.842155 -0.223927 -0.845427
C  -5.186585 -2.063922 -1.719523
C  -6.160738 -3.215277 -1.908798
C  -4.588287 -1.621854 -3.046378
C  -2.96653 -3.174072 -1.232369
C  0.800812 1.376202 0.329763
C  -1.604022 1.225247 0.242914
C  -2.825744 0.390545 0.065104
C  -0.35192 0.619924 0.258736
C  2.590717 0.352363 -0.869205
C  4.595665 -0.191635 0.302394
C  2.768708 0.755675 1.560484
C  0.694067 2.753961 0.386139
C  4.114634 0.254584 1.472513
C  -1.674273 2.616016 0.332744
C  -0.52882 3.38854 0.409262
C  4.312289 -0.785677 -2.11702
C  6.034943 -0.660543 0.235772
H  -5.72595 -1.217941 -1.300696
H  -5.66014 -4.101423 -2.303248
H  -6.645356 -3.483519 -0.970107
H  -6.938816 -2.931692 -2.618295
H  -4.129399 -2.448947 -3.588937
H  -3.84655 -0.833703 -2.92742
H  -5.38915 -1.229739 -3.673529
H  -2.456827 -3.687348 -0.421255
H  -2.2553 -2.514513 -1.731153
H  -3.292659 -3.938101 -1.935311
H  -2.137429 -0.909974 1.522333
H  -0.263968 -0.457543 0.194998
H  4.710432 0.275236 2.371021
H  -0.58054 4.466269 0.48431
H  4.922432 -1.664511 -1.945943
H  4.864134 -0.050762 -2.698157
H  3.453388 -1.111559 -2.691799
elementType: Cl S F O N C H
totalener: -2511.22579688 hartree
nucrepener: 3853.11897302 hartree
electener: -6364.34476990 hartree
twoeener: 4755.79897482 hartree
cpcmener: -0.06726756 hartree
kineticenergy: 2503.30484423 hartree
xcener: -187.679457595904 hartree
chargesum: 0.0000000
charge: -0.044455 0.863020 -0.197358 -0.158393 -0.160590 -0.161073 -0.511927 -0.529597 -0.456953 -0.490651 -0.488246 -0.143895 -0.158390 -0.069905 -0.097611 0.068568 -0.257124 -0.270264 -0.195322 -0.043357 0.071658 0.300683 -0.102821 0.431510 0.020124 0.374787 0.260619 -0.156285 0.073195 -0.147389 -0.193238 0.536954 0.073542 0.088932 0.089803 0.094329 0.093564 0.098573 0.105504 0.124950 0.116411 0.124827 0.202388 0.151342 0.140206 0.137489 0.134849 0.141646 0.115372
qa: -0.0445 0.8630 -0.1974 -0.1584 -0.1606 -0.1611 -0.5119 -0.5296 -0.4570 -0.4907 -0.4882 -0.1439 -0.1584 -0.0699 -0.0976 0.0686 -0.2571 -0.2703 -0.1953 -0.0434 0.0717 0.3007 -0.1028 0.4315 0.0201 0.3748 0.2606 -0.1563 0.0732 -0.1474 -0.1932 0.5370 0.0735 0.0889 0.0898 0.0943 0.0936 0.0986 0.1055 0.1250 0.1164 0.1248 0.2024 0.1513 0.1402 0.1375 0.1348 0.1416 0.1154
va: 1.2720 6.0466 1.1076 1.1530 1.1467 1.1500 1.9688 1.9619 2.0375 2.0201 2.0198 3.0265 3.1559 3.1249 3.3707 3.8715 3.9415 3.8873 3.9057 3.6380 3.6117 4.2011 4.0560 4.2124 3.9743 4.1794 4.1257 3.8895 3.9307 4.0256 3.8570 4.4150 1.0289 1.0056 1.0126 1.0045 0.9984 1.0166 1.0033 1.0114 0.9852 0.9915 1.0059 1.0161 1.0203 1.0155 1.0049 0.9879 1.0102
dispcorr: -0.028717206 hartree
energy: -2511.254514086655
dipole: -44.40896 47.98844 3.57947 -30.12682 28.49961 -1.62721 -24.48555 22.19757 -2.28798
magnitude: 4.54921 au
magnitude: 11.56317 debye
