program: Orca
programVersion: 5.0.2
elementType: Cl S F F F F O O O O O N N N N C C C C C C C C C C C C C C C C C H H H H H H H H H H H H H H H H H
charge: 0
multiplicity: 1
keywords: wb97x-d3
keywords: def2-TZVPP
keywords: def2/J RIJCOSX
keywords: DEFGRID2
keywords: scfconv7
keywords: smallprint printgap noloewdin
keywords: NOSOSCF
formula: C17H17ClF4N4O5S
InChI: InChI=1/C17H17ClF4N4O5S/c1-8(2)25(4)32(30,31)23-15(28)9-5-12(11(19)6-10(9)18)26-14(27)7-13(17(20,21)22)24(3)16(26)29/h5-8,23H,1-4H3
49 atoms
Cl -3.159191 3.152704 1.441438
S  -4.053287 -1.04287 -1.729295
F  1.836404 3.134973 1.624455
F  6.555081 -1.226384 0.890259
F  5.931486 -1.933991 -1.030683
F  6.728796 0.061645 -0.813779
O  -3.537402 -1.332909 -3.052047
O  -5.269454 -0.271634 -1.594739
O  -3.720998 0.192282 0.970104
O  2.004414 1.346161 -1.673694
O  2.268581 0.145042 2.678602
N  -4.186736 -2.391037 -0.863725
N  -2.775421 -0.150956 -1.056376
N  2.116391 0.674885 0.48076
N  3.85296 0.192603 -1.024809
C  -5.283848 -2.594781 0.111048
C  -4.751993 -3.073262 1.452835
C  -6.309273 -3.559207 -0.462298
C  -3.08084 -3.338371 -0.886877
C  0.834094 1.241138 0.701688
C  -1.569731 1.1274 0.570716
C  -2.794786 0.357971 0.206699
C  -0.317465 0.569345 0.34288
C  2.62498 0.778211 -0.802645
C  4.56854 -0.326943 0.02582
C  2.784986 0.145958 1.578954
C  0.725665 2.488433 1.289062
C  4.09303 -0.369423 1.279244
C  -1.643364 2.383484 1.172169
C  -0.498336 3.07475 1.530068
C  4.356229 0.279657 -2.400685
C  5.959926 -0.861836 -0.238111
H  -5.764632 -1.632885 0.27222
H  -4.350938 -4.085968 1.402246
H  -3.979221 -2.415702 1.848974
H  -5.574083 -3.085427 2.168536
H  -7.1221 -3.70734 0.249278
H  -5.867629 -4.535442 -0.669528
H  -6.739886 -3.174056 -1.386572
H  -2.53249 -3.279684 -1.823251
H  -3.479462 -4.348569 -0.815869
H  -2.384509 -3.17274 -0.064296
H  -2.019628 0.08405 -1.691424
H  -0.230919 -0.410868 -0.109452
H  4.663043 -0.77906 2.09732
H  -0.551442 4.055798 1.982551
H  4.969711 -0.577037 -2.647228
H  4.917686 1.198138 -2.555716
H  3.513962 0.263917 -3.081992
elementType: Cl S F O N C H
totalener: -2511.22650371 hartree
nucrepener: 3850.56831526 hartree
electener: -6361.79481897 hartree
twoeener: 4753.26040516 hartree
cpcmener: -0.06719226 hartree
kineticenergy: 2503.31313024 hartree
xcener: -187.680723245591 hartree
chargesum: 0.0000000
charge: -0.044247 0.861962 -0.197363 -0.158294 -0.161773 -0.160334 -0.527749 -0.511095 -0.455842 -0.490449 -0.490921 -0.140084 -0.160569 -0.066124 -0.099461 0.060701 -0.267374 -0.257063 -0.194393 -0.044912 0.064140 0.298503 -0.102061 0.432417 0.015810 0.374601 0.264957 -0.150765 0.081675 -0.156030 -0.190194 0.535775 0.074810 0.094129 0.098276 0.105220 0.095118 0.089010 0.089842 0.124477 0.125175 0.115358 0.203013 0.153901 0.139849 0.137787 0.131452 0.143102 0.116036
qa: -0.0442 0.8620 -0.1974 -0.1583 -0.1618 -0.1603 -0.5277 -0.5111 -0.4558 -0.4904 -0.4909 -0.1401 -0.1606 -0.0661 -0.0995 0.0607 -0.2674 -0.2571 -0.1944 -0.0449 0.0641 0.2985 -0.1021 0.4324 0.0158 0.3746 0.2650 -0.1508 0.0817 -0.1560 -0.1902 0.5358 0.0748 0.0941 0.0983 0.1052 0.0951 0.0890 0.0898 0.1245 0.1252 0.1154 0.2030 0.1539 0.1398 0.1378 0.1315 0.1431 0.1160
va: 1.2735 6.0472 1.1068 1.1529 1.1466 1.1510 1.9639 1.9688 2.0397 2.0203 2.0170 3.0268 3.1484 3.1264 3.3811 3.8776 3.8879 3.9420 3.9066 3.6276 3.6268 4.1971 4.0451 4.2095 3.9784 4.1813 4.1247 3.8833 3.9201 4.0346 3.8587 4.4179 1.0281 0.9981 1.0151 1.0039 1.0046 1.0056 1.0125 1.0118 0.9907 0.9854 1.0048 1.0142 1.0207 1.0155 1.0073 0.9871 1.0094
dispcorr: -0.028647501 hartree
energy: -2511.255151207996
dipole: -45.26187 48.70480 3.44292 -32.16569 30.13264 -2.03305 -6.90905 6.42477 -0.48428
magnitude: 4.02760 au
magnitude: 10.23734 debye
