program: Orca
programVersion: 5.0.2
elementType: Cl S F F F F O O O O O N N N N C C C C C C C C C C C C C C C C C H H H H H H H H H H H H H H H H H
charge: 0
multiplicity: 1
keywords: wb97x-d3
keywords: def2-TZVPP
keywords: def2/J RIJCOSX
keywords: DEFGRID2
keywords: scfconv7
keywords: smallprint printgap noloewdin
keywords: NOSOSCF
formula: C17H17ClF4N4O5S
InChI: InChI=1/C17H17ClF4N4O5S/c1-8(2)25(4)32(30,31)23-15(28)9-5-12(11(19)6-10(9)18)26-14(27)7-13(17(20,21)22)24(3)16(26)29/h5-8,23H,1-4H3
49 atoms
Cl -3.209925 3.108653 0.458496
S  -4.953015 -0.954168 0.24696
F  1.746864 3.310303 1.161849
F  6.184265 -1.962999 0.910958
F  6.32477 -1.304863 -1.120596
F  7.015719 -0.034091 0.48593
O  -5.616995 -0.344166 -0.88184
O  -5.556688 -0.928711 1.562106
O  -2.671979 -0.211022 -1.573868
O  2.676047 2.007875 -1.478055
O  1.715058 -0.532538 2.142313
N  -4.545956 -2.465505 -0.134605
N  -3.518116 -0.085508 0.524089
N  2.202758 0.743518 0.331383
N  4.34299 0.713532 -0.639616
C  -4.507698 -2.942121 -1.53627
C  -5.675908 -3.881944 -1.789418
C  -3.175067 -3.599279 -1.865306
C  -3.967444 -3.306175 0.904559
C  0.895264 1.292968 0.347282
C  -1.477791 1.074681 0.015889
C  -2.610078 0.213153 -0.442168
C  -0.195957 0.546113 -0.049206
C  3.054868 1.205761 -0.657015
C  4.688329 -0.287396 0.233178
C  2.522177 -0.20533 1.300045
C  0.69491 2.592267 0.78283
C  3.850726 -0.748165 1.174174
C  -1.64264 2.388428 0.441322
C  -0.559256 3.161826 0.822276
C  5.244646 1.278755 -1.648703
C  6.068502 -0.901137 0.12366
H  -4.619317 -2.074852 -2.182825
H  -6.629245 -3.380756 -1.620366
H  -5.659682 -4.228478 -2.82385
H  -5.632934 -4.76375 -1.146842
H  -3.041562 -4.550097 -1.347519
H  -2.328108 -2.956759 -1.627101
H  -3.138687 -3.807658 -2.934996
H  -4.38541 -3.068573 1.879074
H  -2.881308 -3.213506 0.954719
H  -4.220522 -4.343899 0.696311
H  -3.366023 0.21824 1.479861
H  -0.047188 -0.466305 -0.403606
H  4.129628 -1.532007 1.860101
H  -0.682075 4.187273 1.144032
H  5.168237 0.739784 -2.590816
H  6.270027 1.277319 -1.302117
H  4.974124 2.315127 -1.815818
elementType: Cl S F O N C H
totalener: -2511.23162450 hartree
nucrepener: 3838.75140870 hartree
electener: -6349.98303320 hartree
twoeener: 4741.88018824 hartree
cpcmener: -0.05174728 hartree
kineticenergy: 2503.32191933 hartree
xcener: -187.676508752473 hartree
chargesum: 0.0000000
charge: -0.046532 0.861121 -0.198491 -0.157749 -0.161076 -0.160805 -0.494361 -0.513579 -0.433199 -0.461120 -0.457593 -0.142054 -0.195819 -0.075689 -0.102316 0.059657 -0.257408 -0.265316 -0.201146 -0.007270 0.063651 0.305125 -0.128138 0.417610 0.009217 0.347678 0.259826 -0.153855 0.072125 -0.154767 -0.187241 0.536505 0.073892 0.091570 0.093752 0.086085 0.091837 0.098647 0.104072 0.130213 0.116603 0.118154 0.205651 0.151287 0.138114 0.138837 0.139284 0.128821 0.116191
qa: -0.0465 0.8611 -0.1985 -0.1577 -0.1611 -0.1608 -0.4944 -0.5136 -0.4332 -0.4611 -0.4576 -0.1421 -0.1958 -0.0757 -0.1023 0.0597 -0.2574 -0.2653 -0.2011 -0.0073 0.0637 0.3051 -0.1281 0.4176 0.0092 0.3477 0.2598 -0.1539 0.0721 -0.1548 -0.1872 0.5365 0.0739 0.0916 0.0938 0.0861 0.0918 0.0986 0.1041 0.1302 0.1166 0.1182 0.2057 0.1513 0.1381 0.1388 0.1393 0.1288 0.1162
va: 1.2748 6.0563 1.1058 1.1535 1.1506 1.1464 1.9928 1.9849 2.0800 2.0594 2.0567 3.0232 3.1358 3.1160 3.3675 3.8894 3.9411 3.8875 3.9098 3.5958 3.6243 4.1964 4.0869 4.2260 3.9744 4.2121 4.1166 3.8748 3.9382 4.0194 3.8626 4.4194 1.0291 1.0131 1.0042 1.0063 0.9990 1.0127 1.0045 1.0104 0.9856 0.9916 1.0039 1.0127 1.0217 1.0132 0.9883 1.0084 1.0083
dispcorr: -0.028930287 hartree
energy: -2511.260554783727
dipole: -39.25213 42.70830 3.45618 -32.17167 30.66663 -1.50504 -13.33878 13.64284 0.30407
magnitude: 3.78190 au
magnitude: 9.61282 debye
