program: Orca
programVersion: 5.0.2
elementType: Cl S F F F F O O O O O N N N N C C C C C C C C C C C C C C C C C H H H H H H H H H H H H H H H H H
charge: 0
multiplicity: 1
keywords: wb97x-d3
keywords: def2-TZVPP
keywords: def2/J RIJCOSX
keywords: DEFGRID2
keywords: scfconv7
keywords: smallprint printgap noloewdin
keywords: NOSOSCF
formula: C17H17ClF4N4O5S
InChI: InChI=1/C17H17ClF4N4O5S/c1-8(2)25(4)32(30,31)23-15(28)9-5-12(11(19)6-10(9)18)26-14(27)7-13(17(20,21)22)24(3)16(26)29/h5-8,23H,1-4H3
49 atoms
Cl -3.168311 3.321292 1.291219
S  -4.234317 -1.080246 -1.589224
F  1.813142 3.113934 1.531296
F  6.836232 -0.003793 0.21419
F  6.111942 -1.982576 0.598837
F  6.109292 -1.232763 -1.40695
O  -3.685096 -1.702636 -2.776125
O  -5.328082 -0.142836 -1.704965
O  -3.85549 0.436435 0.927617
O  2.35713 2.025768 -1.339614
O  1.664623 -0.774691 2.145545
N  -4.608996 -2.202962 -0.501852
N  -2.880227 -0.243129 -0.993015
N  2.028183 0.646859 0.41723
N  4.089904 0.696149 -0.712659
C  -3.680812 -3.335013 -0.305662
C  -4.349653 -4.637928 -0.713882
C  -3.1496 -3.373936 1.118344
C  -5.716496 -2.034792 0.427233
C  0.757444 1.245997 0.615385
C  -1.652065 1.201195 0.490944
C  -2.903459 0.45122 0.181876
C  -0.414782 0.603724 0.270914
C  2.801492 1.176622 -0.602769
C  4.510794 -0.342868 0.079671
C  2.413785 -0.374301 1.281571
C  0.684303 2.503591 1.187757
C  3.739871 -0.88296 1.035603
C  -1.686224 2.478619 1.053476
C  -0.519133 3.140307 1.396342
C  4.90651 1.311663 -1.763599
C  5.905967 -0.895257 -0.133503
H  -2.828718 -3.177445 -0.968013
H  -4.70601 -4.589343 -1.74305
H  -3.63491 -5.458726 -0.645239
H  -5.19355 -4.885297 -0.068279
H  -2.389282 -4.151428 1.19742
H  -3.928429 -3.605262 1.846012
H  -2.684857 -2.428039 1.399626
H  -6.269821 -2.970956 0.486682
H  -6.405878 -1.275208 0.074476
H  -5.380135 -1.75942 1.425072
H  -2.12883 -0.10475 -1.660934
H  -0.357504 -0.386967 -0.162813
H  4.078497 -1.696282 1.657394
H  -0.540754 4.134654 1.822031
H  4.807159 0.773247 -2.704018
H  5.947723 1.363005 -1.470392
H  4.573053 2.332334 -1.910245
elementType: Cl S F O N C H
totalener: -2511.23198833 hartree
nucrepener: 3860.47079245 hartree
electener: -6371.70278079 hartree
twoeener: 4763.29521423 hartree
cpcmener: -0.05314733 hartree
kineticenergy: 2503.31958766 hartree
xcener: -187.679110990359 hartree
chargesum: 0.0000000
charge: -0.040984 0.849845 -0.198079 -0.160928 -0.157531 -0.160633 -0.517862 -0.495326 -0.425547 -0.460933 -0.457997 -0.140000 -0.156018 -0.076452 -0.099960 0.063553 -0.256994 -0.275652 -0.183950 -0.016393 0.089334 0.268019 -0.128288 0.412903 0.008978 0.345548 0.258227 -0.151536 0.058608 -0.144788 -0.190308 0.535451 0.072196 0.094513 0.096094 0.088708 0.102918 0.095025 0.098742 0.118557 0.126666 0.106801 0.195830 0.148701 0.138576 0.135260 0.139619 0.130467 0.117022
qa: -0.0410 0.8498 -0.1981 -0.1609 -0.1575 -0.1606 -0.5179 -0.4953 -0.4255 -0.4609 -0.4580 -0.1400 -0.1560 -0.0765 -0.1000 0.0636 -0.2570 -0.2757 -0.1840 -0.0164 0.0893 0.2680 -0.1283 0.4129 0.0090 0.3455 0.2582 -0.1515 0.0586 -0.1448 -0.1903 0.5355 0.0722 0.0945 0.0961 0.0887 0.1029 0.0950 0.0987 0.1186 0.1267 0.1068 0.1958 0.1487 0.1386 0.1353 0.1396 0.1305 0.1170
va: 1.2748 6.0539 1.1077 1.1462 1.1540 1.1507 1.9660 1.9944 2.0648 2.0586 2.0554 3.0207 3.1364 3.1172 3.3662 3.8981 3.9241 3.9165 3.9124 3.6495 3.6007 4.2291 4.0616 4.2299 3.9760 4.2170 4.1205 3.8700 3.9514 4.0271 3.8574 4.4196 1.0208 1.0142 1.0045 1.0041 1.0058 0.9976 1.0079 0.9890 1.0124 0.9906 1.0094 1.0187 1.0214 1.0163 0.9879 1.0067 1.0108
dispcorr: -0.028852980 hartree
energy: -2511.260841315292
dipole: -40.03762 43.39261 3.35499 -30.80254 29.51051 -1.29203 -4.15390 4.31005 0.15615
magnitude: 3.59857 au
magnitude: 9.14683 debye
