program: Orca
programVersion: 5.0.2
elementType: Cl S F F F F O O O O O N N N N C C C C C C C C C C C C C C C C C H H H H H H H H H H H H H H H H H
charge: 0
multiplicity: 1
keywords: wb97x-d3
keywords: def2-TZVPP
keywords: def2/J RIJCOSX
keywords: DEFGRID2
keywords: scfconv7
keywords: smallprint printgap noloewdin
keywords: NOSOSCF
formula: C17H17ClF4N4O5S
InChI: InChI=1/C17H17ClF4N4O5S/c1-8(2)25(4)32(30,31)23-15(28)9-5-12(11(19)6-10(9)18)26-14(27)7-13(17(20,21)22)24(3)16(26)29/h5-8,23H,1-4H3
49 atoms
Cl -3.278781 2.562182 0.388732
S  -4.63404 -1.689338 0.757116
F  1.629189 3.433946 0.675287
F  6.936741 -0.47666 1.408789
F  6.48582 -1.623061 -0.345545
F  7.162403 0.418372 -0.525003
O  -5.61541 -1.146182 1.665661
O  -4.014406 -2.965153 0.987642
O  -2.083177 -1.350455 -0.766842
O  2.353341 0.947752 -1.917342
O  2.419176 0.84246 2.604571
N  -5.196948 -1.648547 -0.760952
N  -3.428618 -0.478574 0.821408
N  2.371484 0.816919 0.337687
N  4.284428 0.266535 -0.91912
C  -4.815724 -2.668833 -1.756417
C  -4.391158 -2.033048 -3.07299
C  -5.95628 -3.659453 -1.945565
C  -5.975565 -0.498839 -1.179324
C  1.006878 1.205855 0.357262
C  -1.342293 0.639941 0.247507
C  -2.316587 -0.479407 0.036432
C  0.001286 0.277701 0.206357
C  2.962488 0.700838 -0.910697
C  4.961953 0.063299 0.2607
C  3.008992 0.656094 1.572763
C  0.665077 2.535081 0.534777
C  4.392787 0.242955 1.461148
C  -1.64751 1.988801 0.412103
C  -0.650786 2.941982 0.555122
C  4.901142 0.134068 -2.24007
C  6.402387 -0.405976 0.196954
H  -3.955441 -3.200908 -1.357867
H  -4.024755 -2.812974 -3.740514
H  -5.218511 -1.538034 -3.584131
H  -3.584179 -1.316706 -2.932655
H  -6.203324 -4.150811 -1.00552
H  -5.674003 -4.429584 -2.664225
H  -6.857544 -3.173485 -2.324692
H  -6.487148 -0.052542 -0.331038
H  -6.743309 -0.822367 -1.880789
H  -5.361479 0.264012 -1.663143
H  -3.574936 0.226876 1.528854
H  0.259905 -0.761021 0.05132
H  4.929149 0.081297 2.381426
H  -0.894486 3.98862 0.670848
H  5.472126 -0.78512 -2.31365
H  5.539677 0.985909 -2.465875
H  4.109474 0.096361 -2.978263
totalener: -2511.19901315 hartree
nucrepener: 3828.84710077 hartree
electener: -6340.04611391 hartree
twoeener: 4732.18682499 hartree
kineticenergy: 2503.39405486 hartree
xcener: -187.677929338000 hartree
chargesum: 0.0000000
charge: -0.051603 0.842332 -0.186031 -0.150511 -0.157227 -0.156598 -0.465704 -0.428448 -0.379416 -0.369604 -0.341774 -0.151233 -0.202230 -0.120738 -0.129696 0.037784 -0.246382 -0.230268 -0.211218 0.021237 0.046372 0.279517 -0.043527 0.355965 -0.022548 0.295923 0.255171 -0.157604 0.036196 -0.159261 -0.209117 0.539186 0.082841 0.089606 0.075786 0.107136 0.099111 0.081481 0.068130 0.129495 0.102059 0.101636 0.168201 0.118717 0.135450 0.120713 0.126306 0.128209 0.126179
qa: -0.0516 0.8423 -0.1860 -0.1505 -0.1572 -0.1566 -0.4657 -0.4284 -0.3794 -0.3696 -0.3418 -0.1512 -0.2022 -0.1207 -0.1297 0.0378 -0.2464 -0.2303 -0.2112 0.0212 0.0464 0.2795 -0.0435 0.3560 -0.0225 0.2959 0.2552 -0.1576 0.0362 -0.1593 -0.2091 0.5392 0.0828 0.0896 0.0758 0.1071 0.0991 0.0815 0.0681 0.1295 0.1021 0.1016 0.1682 0.1187 0.1354 0.1207 0.1263 0.1282 0.1262
va: 1.2735 6.0627 1.1230 1.1621 1.1507 1.1536 2.0338 2.0618 2.1188 2.1412 2.1711 2.9962 3.1564 3.0744 3.3160 3.9341 3.8814 3.9362 3.9309 3.6155 3.6450 4.1847 4.1189 4.2697 3.9726 4.2660 4.1746 3.8455 3.9603 4.0157 3.8558 4.4117 1.0262 1.0100 0.9998 1.0187 1.0153 1.0079 1.0091 1.0166 0.9959 0.9872 1.0424 1.0343 1.0239 1.0193 1.0033 0.9906 1.0218
dispcorr: -0.029004729 hartree
energy: -2511.228017875191
dipole: -51.94331 52.92196 0.97865 -21.37204 22.22855 0.85651 -24.87363 23.27688 -1.59675
magnitude: 2.05936 au
magnitude: 5.23449 debye
