program: Orca
programVersion: 5.0.2
elementType: Cl Cl F F F O O O O N N C C C C C C C C C C C C C C C H H H H H H H H H H H H H
charge: 0
multiplicity: 1
keywords: wb97x-d3
keywords: def2-TZVPP
keywords: def2/J RIJCOSX
keywords: DEFGRID2
keywords: scfconv7
keywords: smallprint printgap noloewdin
keywords: NOSOSCF
formula: C15H13Cl2F3N2O4
InChI: InChI=1/C15H13Cl2F3N2O4/c1-3-24-11(23)6-25-10-4-7(9(18)5-8(10)16)13-12(17)14(22(2)21-13)26-15(19)20/h4-5,15H,3,6H2,1-2H3
39 atoms
Cl -1.616888 0.57879 -1.872902
Cl 4.592531 -2.272309 -0.2661
F  -0.107712 -3.447549 1.033395
F  -5.595698 -1.37282 -0.398039
F  -4.616139 -0.508643 -2.107931
O  3.421143 0.271814 -0.824153
O  -4.369393 0.478247 -0.116151
O  2.373394 3.645582 -0.426259
O  3.072954 2.155809 1.102181
N  -3.086574 -0.818493 1.392305
N  -1.854629 -1.280208 1.542813
C  -1.167788 -0.892788 0.479648
C  0.245175 -1.232413 0.30922
C  -1.996994 -0.153191 -0.380928
C  -3.222086 -0.141476 0.238927
C  1.1511 -0.281544 -0.162582
C  0.729007 -2.499228 0.596573
C  2.491089 -0.584879 -0.3524
C  2.0573 -2.832182 0.428926
C  2.931616 -1.874336 -0.046911
C  -4.096022 -1.102229 2.387785
C  3.028322 1.55914 -1.226172
C  -5.228372 -0.200551 -0.950908
C  2.828351 2.471609 -0.034813
C  2.162299 4.676095 0.560728
C  3.444132 5.38922 0.920331
H  0.779558 0.71295 -0.365667
H  2.400956 -3.832435 0.65728
H  -4.501875 -2.102499 2.252767
H  -4.898428 -0.374613 2.319911
H  -3.64291 -1.028723 3.371603
H  3.849355 1.954325 -1.827856
H  2.139798 1.549262 -1.864856
H  -6.096508 0.428684 -1.128752
H  1.676986 4.252553 1.440501
H  1.460133 5.360007 0.088514
H  3.929766 5.803881 0.037157
H  3.208227 6.217096 1.589515
H  4.150248 4.738197 1.434242
elementType: Cl F O N C H
totalener: -2209.92064121 hartree
nucrepener: 2753.65184121 hartree
electener: -4963.57248242 hartree
oneelecener: -8520.04640905 hartree
twoeener: 3556.47392663 hartree
cpcmener: -0.04172308 hartree
kineticenergy: 2203.70077543 hartree
xcener: -157.824333057834 hartree
chargesum: -0.0000000
charge: -0.060648 -0.076364 -0.212850 -0.201505 -0.196834 -0.317297 -0.321696 -0.296053 -0.466227 0.121463 -0.324528 0.212888 -0.121918 -0.102809 0.205924 -0.146612 0.241522 0.190789 -0.195620 0.033965 -0.169474 0.020923 0.428613 0.413950 0.037319 -0.249782 0.134237 0.132195 0.129835 0.125477 0.123641 0.149536 0.133157 0.142413 0.094401 0.112747 0.089165 0.097941 0.088114
qa: -0.0606 -0.0764 -0.2129 -0.2015 -0.1968 -0.3173 -0.3217 -0.2961 -0.4662 0.1215 -0.3245 0.2129 -0.1219 -0.1028 0.2059 -0.1466 0.2415 0.1908 -0.1956 0.0340 -0.1695 0.0209 0.4286 0.4140 0.0373 -0.2498 0.1342 0.1322 0.1298 0.1255 0.1236 0.1495 0.1332 0.1424 0.0944 0.1127 0.0892 0.0979 0.0881
va: 1.2506 1.2363 1.0779 1.0829 1.0881 2.0926 2.1221 2.1315 2.0317 3.3472 2.9095 3.7662 3.5739 3.9748 4.0801 3.8334 4.0369 4.0197 4.0342 3.8613 3.8776 3.8850 4.2118 4.0598 3.8470 3.9192 1.0200 1.0184 0.9872 0.9976 1.0025 0.9945 1.0031 0.9746 1.0086 0.9955 1.0045 1.0065 1.0120
dispcorr: -0.019371818 hartree
energy: -2209.940013032315
dipole: 10.09891 -12.56452 -2.46561 30.07624 -27.59657 2.47967 12.17893 -12.63508 -0.45616
magnitude: 3.52648 au
magnitude: 8.96360 debye
