program: Orca
programVersion: 5.0.2
elementType: Cl Cl F F F O O O O N N C C C C C C C C C C C C C C C H H H H H H H H H H H H H
charge: 0
multiplicity: 1
keywords: wb97x-d3
keywords: def2-TZVPP
keywords: def2/J RIJCOSX
keywords: DEFGRID2
keywords: scfconv7
keywords: smallprint printgap noloewdin
keywords: NOSOSCF
formula: C15H13Cl2F3N2O4
InChI: InChI=1/C15H13Cl2F3N2O4/c1-3-24-11(23)6-25-10-4-7(9(18)5-8(10)16)13-12(17)14(22(2)21-13)26-15(19)20/h4-5,15H,3,6H2,1-2H3
39 atoms
Cl -1.042856 1.577467 0.147312
Cl 4.781495 -2.008484 1.247365
F  -0.066282 -3.250997 1.634373
F  -4.018547 1.687481 1.142186
F  -5.143264 -0.148164 1.074589
O  3.750047 -0.00331 -0.520164
O  -4.006141 0.484622 -0.742835
O  2.168804 3.109501 -1.138207
O  2.842586 2.211457 0.802678
N  -2.989692 -1.644428 -0.635198
N  -1.810483 -2.202417 -0.399089
C  -0.977147 -1.217513 -0.106207
C  0.432868 -1.447958 0.205867
C  -1.6517 0.014273 -0.15454
C  -2.943151 -0.309131 -0.490069
C  1.41248 -0.623061 -0.346415
C  0.843674 -2.449751 1.069188
C  2.753925 -0.772052 -0.029656
C  2.172096 -2.640596 1.390448
C  3.120752 -1.797498 0.843474
C  -4.139565 -2.467488 -0.93811
C  3.407717 1.134971 -1.271777
C  -4.755482 0.906436 0.332603
C  2.773187 2.201784 -0.4009
C  1.535261 4.23195 -0.489148
C  0.560589 4.838155 -1.464243
H  1.095582 0.130658 -1.053571
H  2.458997 -3.428966 2.07353
H  -4.578305 -2.868793 -0.027166
H  -3.821138 -3.287803 -1.573888
H  -4.883837 -1.884475 -1.470629
H  4.346064 1.533414 -1.66374
H  2.778719 0.898036 -2.133922
H  -5.617244 1.450431 -0.045029
H  2.307068 4.946505 -0.200401
H  1.026548 3.901955 0.416735
H  0.087582 5.70196 -0.997851
H  1.053487 5.179753 -2.373569
H  -0.225599 4.134077 -1.735515
elementType: Cl F O N C H
totalener: -2209.92087889 hartree
nucrepener: 2818.91315966 hartree
electener: -5028.83403855 hartree
oneelecener: -8650.62520263 hartree
twoeener: 3621.79116408 hartree
cpcmener: -0.04277577 hartree
kineticenergy: 2203.71452055 hartree
xcener: -157.826764674150 hartree
chargesum: -0.0000000
charge: -0.067745 -0.075992 -0.213008 -0.196308 -0.200817 -0.319368 -0.321935 -0.274294 -0.461977 0.121355 -0.324001 0.205158 -0.129784 -0.080003 0.205469 -0.134234 0.252098 0.169130 -0.202552 0.042142 -0.170938 0.042666 0.427119 0.379392 0.001781 -0.225851 0.140143 0.132603 0.129154 0.123726 0.127154 0.145434 0.131637 0.142971 0.124716 0.095130 0.091207 0.093183 0.075440
qa: -0.0677 -0.0760 -0.2130 -0.1963 -0.2008 -0.3194 -0.3219 -0.2743 -0.4620 0.1214 -0.3240 0.2052 -0.1298 -0.0800 0.2055 -0.1342 0.2521 0.1691 -0.2026 0.0421 -0.1709 0.0427 0.4271 0.3794 0.0018 -0.2259 0.1401 0.1326 0.1292 0.1237 0.1272 0.1454 0.1316 0.1430 0.1247 0.0951 0.0912 0.0932 0.0754
va: 1.2591 1.2364 1.0791 1.0886 1.0838 2.0954 2.1213 2.1317 2.0318 3.3458 2.9130 3.7815 3.5667 3.9630 4.0837 3.7960 4.0261 3.9991 4.0411 3.8667 3.8781 3.8790 4.2132 4.0914 3.8402 3.9454 1.0236 1.0183 0.9875 1.0024 0.9964 0.9914 1.0012 0.9744 0.9968 0.9967 1.0072 1.0037 1.0152
dispcorr: -0.020862741 hartree
energy: -2209.941741628857
dipole: -0.42490 -2.17406 -2.59896 17.57355 -16.11666 1.45690 -16.40208 13.95452 -2.44756
magnitude: 3.85586 au
magnitude: 9.80083 debye
