program: Orca
programVersion: 5.0.2
elementType: Cl Cl F F F O O O O N N C C C C C C C C C C C C C C C H H H H H H H H H H H H H
charge: 0
multiplicity: 1
keywords: wb97x-d3
keywords: def2-TZVPP
keywords: def2/J RIJCOSX
keywords: DEFGRID2
keywords: scfconv7
keywords: smallprint printgap noloewdin
keywords: NOSOSCF
formula: C15H13Cl2F3N2O4
InChI: InChI=1/C15H13Cl2F3N2O4/c1-3-24-11(23)6-25-10-4-7(9(18)5-8(10)16)13-12(17)14(22(2)21-13)26-15(19)20/h4-5,15H,3,6H2,1-2H3
39 atoms
Cl -2.054023 0.102967 2.175718
Cl 4.675661 -1.74113 1.592274
F  -0.284401 -2.459978 1.914037
F  -6.312769 -0.499001 -0.066603
F  -5.36754 0.356676 1.667245
O  3.926839 -0.085006 -0.611814
O  -4.28411 0.282156 -0.261288
O  2.874555 2.913352 -2.20036
O  3.158124 2.467004 -0.023089
N  -2.541485 -0.538727 -1.58277
N  -1.26192 -0.88855 -1.504953
C  -0.915828 -0.763316 -0.234852
C  0.454134 -1.017711 0.211347
C  -2.003748 -0.302175 0.522115
C  -3.024947 -0.17146 -0.386825
C  1.527284 -0.422749 -0.450565
C  0.726147 -1.844037 1.287143
C  2.834744 -0.629585 -0.035368
C  2.013787 -2.078003 1.723411
C  3.060708 -1.467301 1.059926
C  -3.256078 -0.557547 -2.840681
C  3.757433 0.820982 -1.672335
C  -5.14209 -0.398176 0.578994
C  3.226323 2.153119 -1.184911
C  2.37214 4.238078 -1.925846
C  1.962163 4.852289 -3.238732
H  1.300478 0.218602 -1.291655
H  2.196321 -2.734425 2.563729
H  -2.58933 -0.963494 -3.594055
H  -3.55277 0.44712 -3.133822
H  -4.138042 -1.189801 -2.771102
H  4.751634 0.983479 -2.09463
H  3.132832 0.418539 -2.47526
H  -4.781242 -1.385549 0.872536
H  3.153624 4.825954 -1.441678
H  1.522887 4.167882 -1.244595
H  1.584556 5.857828 -3.05567
H  2.80221 4.932778 -3.928357
H  1.167703 4.28122 -3.718936
elementType: Cl F O N C H
totalener: -2209.92144136 hartree
nucrepener: 2728.88570917 hartree
electener: -4938.80715053 hartree
oneelecener: -8469.78232628 hartree
twoeener: 3530.97517576 hartree
cpcmener: -0.04249562 hartree
kineticenergy: 2203.70375271 hartree
xcener: -157.823363623284 hartree
chargesum: 0.0000000
charge: -0.058770 -0.076511 -0.215793 -0.197048 -0.194447 -0.315999 -0.298815 -0.284310 -0.466456 0.116115 -0.342797 0.250105 -0.200191 -0.098623 0.231900 -0.122744 0.275089 0.176392 -0.197428 0.049721 -0.161729 0.030018 0.392149 0.399035 0.036694 -0.249333 0.123351 0.133332 0.115222 0.128237 0.124555 0.148322 0.135742 0.139436 0.106466 0.100409 0.089980 0.089509 0.089218
qa: -0.0588 -0.0765 -0.2158 -0.1970 -0.1944 -0.3160 -0.2988 -0.2843 -0.4665 0.1161 -0.3428 0.2501 -0.2002 -0.0986 0.2319 -0.1227 0.2751 0.1764 -0.1974 0.0497 -0.1617 0.0300 0.3921 0.3990 0.0367 -0.2493 0.1234 0.1333 0.1152 0.1282 0.1246 0.1483 0.1357 0.1394 0.1065 0.1004 0.0900 0.0895 0.0892
va: 1.2571 1.2358 1.0738 1.0813 1.0754 2.0910 2.0683 2.1380 2.0330 3.3594 2.9283 3.6822 3.6744 3.9950 4.0693 3.8329 3.9416 3.9926 4.0458 3.8593 3.8813 3.8859 4.2499 4.0703 3.8369 3.9718 1.0378 1.0182 1.0082 0.9876 0.9910 0.9923 0.9990 0.9707 0.9943 0.9957 1.0066 1.0033 1.0030
dispcorr: -0.018692346 hartree
energy: -2209.940133705929
dipole: 13.76000 -14.67340 -0.91340 23.14031 -22.67427 0.46604 -32.17350 29.16527 -3.00822
magnitude: 3.17819 au
magnitude: 8.07832 debye
