program: Orca
programVersion: 5.0.2
elementType: Cl Cl F F F O O O O N N C C C C C C C C C C C C C C C H H H H H H H H H H H H H
charge: 0
multiplicity: 1
keywords: wb97x-d3
keywords: def2-TZVPP
keywords: def2/J RIJCOSX
keywords: DEFGRID2
keywords: scfconv7
keywords: smallprint printgap noloewdin
keywords: NOSOSCF
formula: C15H13Cl2F3N2O4
InChI: InChI=1/C15H13Cl2F3N2O4/c1-3-24-11(23)6-25-10-4-7(9(18)5-8(10)16)13-12(17)14(22(2)21-13)26-15(19)20/h4-5,15H,3,6H2,1-2H3
39 atoms
Cl -1.691142 1.040314 1.533382
Cl 4.559692 -1.793377 0.220374
F  0.051203 -3.84285 1.016093
F  -5.533382 -0.086421 -1.075087
F  -4.30374 1.541932 -0.392682
O  2.992558 0.513025 -0.425562
O  -4.631153 -0.204973 0.967872
O  2.971292 3.899034 -1.340918
O  4.652992 2.536241 -0.745562
N  -3.439276 -2.071225 0.117119
N  -2.190922 -2.477408 -0.065862
C  -1.403942 -1.497514 0.35053
C  0.054862 -1.593785 0.304438
C  -2.183983 -0.423913 0.813563
C  -3.481672 -0.830982 0.632884
C  0.815487 -0.484213 -0.070526
C  0.733079 -2.75556 0.637428
C  2.201564 -0.522944 -0.090807
C  2.11103 -2.833612 0.611967
C  2.839706 -1.717384 0.251584
C  -4.546907 -2.920205 -0.26409
C  2.38188 1.743243 -0.732262
C  -5.192873 0.622143 0.01942
C  3.483667 2.752991 -0.934844
C  3.845783 5.029544 -1.530152
C  4.128191 5.742125 -0.229502
H  0.297532 0.414913 -0.37257
H  2.607241 -3.756037 0.883046
H  -4.272524 -3.950925 -0.063128
H  -4.778352 -2.810718 -1.320909
H  -5.423326 -2.674082 0.327075
H  1.767854 1.677522 -1.636806
H  1.737153 2.092811 0.083338
H  -6.068106 1.095642 0.456405
H  3.30354 5.678038 -2.215303
H  4.764315 4.713205 -2.024943
H  3.207252 6.069177 0.252837
H  4.686641 5.120844 0.469834
H  4.727859 6.628669 -0.436986
elementType: Cl F O N C H
totalener: -2209.92045402 hartree
nucrepener: 2697.18045306 hartree
electener: -4907.10090708 hartree
oneelecener: -8406.59196762 hartree
twoeener: 3499.49106054 hartree
cpcmener: -0.04368430 hartree
kineticenergy: 2203.70341755 hartree
xcener: -157.824589590797 hartree
chargesum: -0.0000000
charge: -0.061053 -0.075729 -0.212988 -0.201825 -0.196115 -0.315489 -0.322443 -0.289517 -0.472752 0.122495 -0.325324 0.216084 -0.128522 -0.112456 0.210912 -0.162520 0.238971 0.222854 -0.194691 0.028839 -0.170684 0.031874 0.429733 0.413563 0.036723 -0.249428 0.138519 0.132855 0.122140 0.128920 0.127420 0.136807 0.129843 0.142256 0.111623 0.093748 0.089870 0.088665 0.096821
qa: -0.0611 -0.0757 -0.2130 -0.2018 -0.1961 -0.3155 -0.3224 -0.2895 -0.4728 0.1225 -0.3253 0.2161 -0.1285 -0.1125 0.2109 -0.1625 0.2390 0.2229 -0.1947 0.0288 -0.1707 0.0319 0.4297 0.4136 0.0367 -0.2494 0.1385 0.1329 0.1221 0.1289 0.1274 0.1368 0.1298 0.1423 0.1116 0.0937 0.0899 0.0887 0.0968
va: 1.2492 1.2382 1.0772 1.0829 1.0889 2.0941 2.1207 2.1362 2.0270 3.3447 2.9124 3.7548 3.5864 3.9696 4.0899 3.8413 4.0394 4.0185 4.0208 3.8635 3.8766 3.8395 4.2101 4.1935 3.8396 3.9224 1.0211 1.0180 1.0039 0.9879 0.9955 0.9928 0.9943 0.9747 0.9959 1.0097 1.0040 1.0117 1.0069
dispcorr: -0.018453382 hartree
energy: -2209.938907406620
dipole: 11.28126 -14.61664 -3.33538 22.40233 -20.73177 1.67056 -7.55898 7.18672 -0.37225
magnitude: 3.74888 au
magnitude: 9.52889 debye
