program: Orca
programVersion: 5.0.2
elementType: Cl Cl F F F O O O O N N C C C C C C C C C C C C C C C H H H H H H H H H H H H H
charge: 0
multiplicity: 1
keywords: wb97x-d3
keywords: def2-TZVPP
keywords: def2/J RIJCOSX
keywords: DEFGRID2
keywords: scfconv7
keywords: smallprint printgap noloewdin
keywords: NOSOSCF
formula: C15H13Cl2F3N2O4
InChI: InChI=1/C15H13Cl2F3N2O4/c1-3-24-11(23)6-25-10-4-7(9(18)5-8(10)16)13-12(17)14(22(2)21-13)26-15(19)20/h4-5,15H,3,6H2,1-2H3
39 atoms
Cl -1.840383 0.699123 2.044643
Cl 4.415037 -1.42145 -0.386512
F  0.058773 -3.755731 0.465546
F  -5.63553 0.187288 -0.602017
F  -4.647063 1.581221 0.707287
O  2.734807 0.888789 -0.498851
O  -4.77261 -0.565732 1.319695
O  4.252724 2.846436 -1.072464
O  2.861343 4.382371 -0.229287
N  -3.53419 -2.045945 -0.046257
N  -2.280424 -2.314119 -0.381492
C  -1.521794 -1.42861 0.244518
C  -0.064733 -1.430436 0.10887
C  -2.323289 -0.559886 1.002977
C  -3.608819 -0.988318 0.780138
C  0.625271 -0.239576 -0.122946
C  0.674417 -2.598272 0.199824
C  2.004725 -0.21756 -0.26878
C  2.045618 -2.614094 0.045551
C  2.704304 -1.42419 -0.190338
C  -4.619467 -2.820807 -0.606738
C  2.103728 2.142242 -0.382442
C  -5.417153 0.479254 0.694586
C  3.118753 3.245019 -0.543826
C  5.280227 3.835201 -1.297658
C  6.438944 3.147404 -1.969948
H  0.055901 0.675278 -0.213436
H  2.591004 -3.545405 0.119351
H  -5.50139 -2.7308 0.018349
H  -4.321906 -3.86418 -0.636638
H  -4.854931 -2.486518 -1.614029
H  1.33777 2.286507 -1.154164
H  1.619045 2.261245 0.591541
H  -6.356005 0.658008 1.212114
H  5.578973 4.266293 -0.340932
H  4.882624 4.634459 -1.924731
H  7.227865 3.878316 -2.145116
H  6.853584 2.352164 -1.350888
H  6.154334 2.728324 -2.934798
elementType: Cl F O N C H
totalener: -2209.92006881 hartree
nucrepener: 2697.97379629 hartree
electener: -4907.89386509 hartree
oneelecener: -8408.07946853 hartree
twoeener: 3500.18560344 hartree
cpcmener: -0.04061669 hartree
kineticenergy: 2203.71343414 hartree
xcener: -157.824627737450 hartree
chargesum: 0.0000000
charge: -0.059656 -0.076255 -0.213915 -0.201262 -0.196411 -0.313106 -0.321887 -0.272491 -0.491781 0.121956 -0.326837 0.226659 -0.149957 -0.108657 0.209945 -0.149936 0.247489 0.201609 -0.199623 0.035361 -0.170143 0.055919 0.428259 0.415838 0.031295 -0.249610 0.141199 0.132766 0.125775 0.123860 0.129841 0.134615 0.123657 0.142342 0.104924 0.100322 0.090217 0.087925 0.089756
qa: -0.0597 -0.0763 -0.2139 -0.2013 -0.1964 -0.3131 -0.3219 -0.2725 -0.4918 0.1220 -0.3268 0.2267 -0.1500 -0.1087 0.2099 -0.1499 0.2475 0.2016 -0.1996 0.0354 -0.1701 0.0559 0.4283 0.4158 0.0313 -0.2496 0.1412 0.1328 0.1258 0.1239 0.1298 0.1346 0.1237 0.1423 0.1049 0.1003 0.0902 0.0879 0.0898
va: 1.2500 1.2373 1.0772 1.0834 1.0887 2.0887 2.1200 2.1574 2.0135 3.3449 2.9091 3.7326 3.6068 3.9767 4.0867 3.8304 4.0258 4.0266 4.0266 3.8594 3.8776 3.8748 4.2124 4.1517 3.8428 3.9718 1.0173 1.0180 0.9972 1.0022 0.9874 0.9859 1.0020 0.9748 0.9948 0.9957 1.0068 1.0038 1.0030
dispcorr: -0.018427757 hartree
energy: -2209.938496565996
dipole: 20.35711 -22.12870 -1.77159 13.49124 -13.61471 -0.12347 -12.78882 12.42613 -0.36269
magnitude: 1.81255 au
magnitude: 4.60713 debye
