program: Orca
programVersion: 5.0.2
elementType: Cl Cl F F F O O O O N N C C C C C C C C C C C C C C C H H H H H H H H H H H H H
charge: 0
multiplicity: 1
keywords: wb97x-d3
keywords: def2-TZVPP
keywords: def2/J RIJCOSX
keywords: DEFGRID2
keywords: scfconv7
keywords: smallprint printgap noloewdin
keywords: NOSOSCF
formula: C15H13Cl2F3N2O4
InChI: InChI=1/C15H13Cl2F3N2O4/c1-3-24-11(23)6-25-10-4-7(9(18)5-8(10)16)13-12(17)14(22(2)21-13)26-15(19)20/h4-5,15H,3,6H2,1-2H3
39 atoms
Cl -1.9375 -0.057013 2.263861
Cl 4.835309 -1.795455 1.430594
F  -0.123882 -2.504659 1.799533
F  -5.577087 -1.000073 -0.647383
F  -6.021003 0.483221 0.85752
O  4.049847 0.035226 -0.632279
O  -4.08925 0.571012 -0.116495
O  2.548499 2.868556 -2.120694
O  3.132818 2.537366 0.020684
N  -2.368482 -0.147374 -1.550851
N  -1.107082 -0.557316 -1.50764
C  -0.776106 -0.632469 -0.228297
C  0.590876 -0.962014 0.175359
C  -1.859764 -0.241796 0.572682
C  -2.858629 0.061359 -0.319787
C  1.659528 -0.340806 -0.469607
C  0.877404 -1.858142 1.189594
C  2.972578 -0.569916 -0.087092
C  2.172691 -2.129406 1.581742
C  3.213372 -1.481115 0.944143
C  -3.041685 0.085504 -2.811109
C  3.833702 0.970404 -1.661153
C  -5.052073 -0.294149 0.372334
C  3.134754 2.21206 -1.14008
C  1.718932 4.00469 -1.796411
C  0.351265 3.565595 -1.326883
H  1.418454 0.342064 -1.272714
H  2.365795 -2.842281 2.372299
H  -3.219192 1.147858 -2.962933
H  -3.98664 -0.448865 -2.846438
H  -2.399028 -0.284402 -3.602813
H  4.821796 1.256439 -2.027956
H  3.286573 0.536466 -2.502486
H  -4.686489 -0.980837 1.137261
H  1.64755 4.562541 -2.727552
H  2.216212 4.637953 -1.061408
H  -0.139139 2.935044 -2.068886
H  0.390025 3.026103 -0.381088
H  -0.271084 4.448189 -1.177337
elementType: Cl F O N C H
totalener: -2209.91965467 hartree
nucrepener: 2786.74241087 hartree
electener: -4996.66206554 hartree
oneelecener: -8585.11021219 hartree
twoeener: 3588.44814665 hartree
cpcmener: -0.03858310 hartree
kineticenergy: 2203.70144935 hartree
xcener: -157.823379678254 hartree
chargesum: 0.0000000
charge: -0.059052 -0.075680 -0.214464 -0.198809 -0.190654 -0.317551 -0.309429 -0.285129 -0.461498 0.123677 -0.333133 0.197839 -0.144421 -0.105774 0.244894 -0.142905 0.268106 0.197974 -0.187294 0.028642 -0.162772 0.043058 0.411302 0.380652 0.038561 -0.255801 0.115187 0.132566 0.128965 0.122968 0.117479 0.142624 0.130268 0.126250 0.113026 0.097642 0.088643 0.088214 0.105831
qa: -0.0591 -0.0757 -0.2145 -0.1988 -0.1907 -0.3176 -0.3094 -0.2851 -0.4615 0.1237 -0.3331 0.1978 -0.1444 -0.1058 0.2449 -0.1429 0.2681 0.1980 -0.1873 0.0286 -0.1628 0.0431 0.4113 0.3807 0.0386 -0.2558 0.1152 0.1326 0.1290 0.1230 0.1175 0.1426 0.1303 0.1262 0.1130 0.0976 0.0886 0.0882 0.1058
va: 1.2533 1.2361 1.0756 1.0755 1.0941 2.0962 2.0759 2.1403 2.0323 3.3636 2.9223 3.7316 3.6134 4.0183 4.0477 3.8557 3.9538 4.0085 4.0316 3.8778 3.8711 3.8701 4.2364 4.0956 3.8460 3.9066 1.0415 1.0180 0.9868 0.9996 1.0074 0.9899 1.0045 0.9777 0.9959 1.0095 1.0057 1.0111 1.0087
dispcorr: -0.021001389 hartree
energy: -2209.940656054961
dipole: 8.28579 -9.49075 -1.20496 22.40196 -21.59485 0.80711 -24.84191 22.39983 -2.44208
magnitude: 2.84027 au
magnitude: 7.21939 debye
