program: Orca
programVersion: 5.0.2
elementType: Cl Cl F F F O O O O N N C C C C C C C C C C C C C C C H H H H H H H H H H H H H
charge: 0
multiplicity: 1
keywords: wb97x-d3
keywords: def2-TZVPP
keywords: def2/J RIJCOSX
keywords: DEFGRID2
keywords: scfconv7
keywords: smallprint printgap noloewdin
keywords: NOSOSCF
formula: C15H13Cl2F3N2O4
InChI: InChI=1/C15H13Cl2F3N2O4/c1-3-24-11(23)6-25-10-4-7(9(18)5-8(10)16)13-12(17)14(22(2)21-13)26-15(19)20/h4-5,15H,3,6H2,1-2H3
39 atoms
Cl -1.734106 0.606017 2.041278
Cl 4.684102 -1.702774 1.189584
F  -0.28589 -2.166876 1.772999
F  -4.703166 -0.54937 1.660861
F  -5.442799 -1.115564 -0.277452
O  3.898262 -0.107583 -1.049558
O  -4.218968 0.747104 -0.092869
O  3.084548 2.347576 -0.515392
O  2.58173 2.788753 -2.65784
N  -2.686967 -0.285617 -1.574189
N  -1.435833 -0.729007 -1.597982
C  -0.944834 -0.533057 -0.386052
C  0.436892 -0.861367 -0.036911
C  -1.910945 0.058424 0.439358
C  -3.01901 0.186311 -0.359487
C  1.500334 -0.367278 -0.787342
C  0.724156 -1.643642 1.067249
C  2.815741 -0.603741 -0.414186
C  2.018285 -1.922003 1.45372
C  3.058237 -1.392907 0.712589
C  -3.533246 -0.415265 -2.739883
C  3.702856 0.751929 -2.146338
C  -5.167735 -0.053446 0.502303
C  3.050764 2.077225 -1.802703
C  2.344538 3.486226 -0.02731
C  0.896366 3.125366 0.214163
H  1.260905 0.227647 -1.658151
H  2.210997 -2.541423 2.319522
H  -4.298219 0.355421 -2.729596
H  -4.005339 -1.394965 -2.773723
H  -2.91987 -0.282488 -3.62531
H  4.696531 0.960281 -2.546947
H  3.12666 0.277978 -2.94553
H  -6.061103 0.54232 0.667282
H  2.443046 4.324251 -0.716895
H  2.838863 3.757479 0.902967
H  0.380967 3.994208 0.624142
H  0.383492 2.839633 -0.704489
H  0.803174 2.312669 0.934357
elementType: Cl F O N C H
totalener: -2209.91958836 hartree
nucrepener: 2842.63131213 hartree
electener: -5052.55090048 hartree
oneelecener: -8697.46704040 hartree
twoeener: 3644.91613992 hartree
cpcmener: -0.03706919 hartree
kineticenergy: 2203.72611176 hartree
xcener: -157.828894660875 hartree
chargesum: 0.0000000
charge: -0.064526 -0.076005 -0.215755 -0.195920 -0.200991 -0.320614 -0.321618 -0.273649 -0.475263 0.121921 -0.324613 0.240852 -0.184448 -0.092405 0.214668 -0.183007 0.276502 0.220196 -0.195178 0.042105 -0.170677 0.024174 0.428742 0.395917 0.033453 -0.251466 0.127593 0.133555 0.127530 0.127873 0.122956 0.142281 0.130576 0.141986 0.098278 0.112519 0.111976 0.095803 0.074679
qa: -0.0645 -0.0760 -0.2158 -0.1959 -0.2010 -0.3206 -0.3216 -0.2736 -0.4753 0.1219 -0.3246 0.2409 -0.1844 -0.0924 0.2147 -0.1830 0.2765 0.2202 -0.1952 0.0421 -0.1707 0.0242 0.4287 0.3959 0.0335 -0.2515 0.1276 0.1336 0.1275 0.1279 0.1230 0.1423 0.1306 0.1420 0.0983 0.1125 0.1120 0.0958 0.0747
va: 1.2436 1.2357 1.0744 1.0889 1.0836 2.0892 2.1210 2.1506 2.0255 3.3431 2.9181 3.6816 3.6035 3.9427 4.0980 3.8173 3.9446 3.9592 4.0491 3.8707 3.8758 3.8862 4.2135 4.0892 3.8443 3.9073 1.0379 1.0178 0.9949 0.9882 1.0038 0.9899 1.0024 0.9746 1.0130 0.9953 1.0089 1.0066 1.0101
dispcorr: -0.022394578 hartree
energy: -2209.941982933949
dipole: 6.45764 -8.24557 -1.78793 19.44667 -18.41489 1.03178 -18.78619 18.15128 -0.63490
magnitude: 2.15971 au
magnitude: 5.48956 debye
