program: Orca
programVersion: 5.0.2
elementType: Cl Cl F F F O O O O N N C C C C C C C C C C C C C C C H H H H H H H H H H H H H
charge: 0
multiplicity: 1
keywords: wb97x-d3
keywords: def2-TZVPP
keywords: def2/J RIJCOSX
keywords: DEFGRID2
keywords: scfconv7
keywords: smallprint printgap noloewdin
keywords: NOSOSCF
formula: C15H13Cl2F3N2O4
InChI: InChI=1/C15H13Cl2F3N2O4/c1-3-24-11(23)6-25-10-4-7(9(18)5-8(10)16)13-12(17)14(22(2)21-13)26-15(19)20/h4-5,15H,3,6H2,1-2H3
39 atoms
Cl -2.298912 -2.582945 0.936166
Cl 4.836594 -1.562042 0.813297
F  0.249112 -2.95291 -0.680791
F  -6.368215 -0.531642 0.750205
F  -4.962904 0.98128 1.409583
O  3.555374 0.97508 1.14773
O  -4.460739 -0.422492 -0.250778
O  3.391754 2.15521 -1.206754
O  2.18019 3.861833 -0.401141
N  -2.556685 0.826223 -0.816345
N  -1.234772 0.749076 -0.782922
C  -0.931067 -0.402171 -0.204379
C  0.471477 -0.728921 0.057654
C  -2.10828 -1.093938 0.129186
C  -3.125157 -0.263643 -0.278789
C  1.323483 0.275942 0.519074
C  1.01587 -1.97968 -0.17472
C  2.673184 0.044676 0.734422
C  2.346979 -2.256098 0.066238
C  3.169645 -1.243504 0.520722
C  -3.217249 1.931904 -1.473626
C  3.163038 2.324738 1.134274
C  -5.075855 -0.290029 0.976528
C  2.842101 2.867165 -0.246413
C  3.064735 2.461375 -2.575596
C  1.793096 1.763615 -2.997048
H  0.888952 1.248469 0.709475
H  2.739193 -3.246714 -0.123097
H  -2.491851 2.731678 -1.58643
H  -4.048242 2.293025 -0.873909
H  -3.582604 1.636429 -2.455901
H  2.316437 2.52278 1.797568
H  4.011956 2.889059 1.527754
H  -4.69072 -0.96364 1.744565
H  3.915292 2.098058 -3.149725
H  2.999765 3.54029 -2.717737
H  0.927449 2.097264 -2.424558
H  1.59976 1.984311 -4.047714
H  1.879741 0.681435 -2.897056
elementType: Cl F O N C H
totalener: -2209.92587227 hartree
nucrepener: 2796.51842896 hartree
electener: -5006.44430123 hartree
oneelecener: -8604.49544007 hartree
twoeener: 3598.05113884 hartree
cpcmener: -0.02866157 hartree
kineticenergy: 2203.72498188 hartree
xcener: -157.827116167411 hartree
chargesum: 0.0000000
charge: -0.058516 -0.073349 -0.213659 -0.189172 -0.197976 -0.312275 -0.307566 -0.269320 -0.446798 0.126202 -0.352788 0.258193 -0.171519 -0.094380 0.218777 -0.170222 0.281932 0.201182 -0.203699 0.053464 -0.157528 0.023799 0.410351 0.373759 0.034277 -0.251171 0.124523 0.131884 0.118282 0.117567 0.127933 0.123048 0.138805 0.123739 0.110199 0.094598 0.082077 0.106371 0.088980
qa: -0.0585 -0.0733 -0.2137 -0.1892 -0.1980 -0.3123 -0.3076 -0.2693 -0.4468 0.1262 -0.3528 0.2582 -0.1715 -0.0944 0.2188 -0.1702 0.2819 0.2012 -0.2037 0.0535 -0.1575 0.0238 0.4104 0.3738 0.0343 -0.2512 0.1245 0.1319 0.1183 0.1176 0.1279 0.1230 0.1388 0.1237 0.1102 0.0946 0.0821 0.1064 0.0890
va: 1.2546 1.2389 1.0770 1.0982 1.0775 2.0974 2.0915 2.1465 2.0597 3.3490 2.8859 3.6518 3.6198 4.0222 4.0629 3.7859 3.9444 3.9414 4.0501 3.8767 3.8763 3.8960 4.2328 4.1141 3.8413 3.9121 1.0436 1.0190 1.0045 1.0025 0.9868 1.0022 0.9896 0.9827 0.9953 1.0126 1.0197 1.0105 1.0029
dispcorr: -0.021594828 hartree
energy: -2209.947467094375
dipole: 13.03367 -13.49764 -0.46397 26.40495 -25.79808 0.60687 -17.27152 16.85998 -0.41153
magnitude: 0.86771 au
magnitude: 2.20553 debye
