program: Orca
programVersion: 5.0.2
elementType: Cl Cl F F F O O O O N N C C C C C C C C C C C C C C C H H H H H H H H H H H H H
charge: 0
multiplicity: 1
keywords: wb97x-d3
keywords: def2-TZVPP
keywords: def2/J RIJCOSX
keywords: DEFGRID2
keywords: scfconv7
keywords: smallprint printgap noloewdin
keywords: NOSOSCF
formula: C15H13Cl2F3N2O4
InChI: InChI=1/C15H13Cl2F3N2O4/c1-3-24-11(23)6-25-10-4-7(9(18)5-8(10)16)13-12(17)14(22(2)21-13)26-15(19)20/h4-5,15H,3,6H2,1-2H3
39 atoms
Cl -1.635361 0.599878 -1.880474
Cl 4.60051 -2.265348 -0.236039
F  -0.105581 -3.44019 1.042546
F  -5.621595 -1.356009 -0.375983
F  -4.668449 -0.497775 -2.103936
O  3.427229 0.269138 -0.820446
O  -4.373592 0.480435 -0.114208
O  2.374298 3.638756 -0.425495
O  3.045053 2.148525 1.113562
N  -3.087973 -0.830844 1.376325
N  -1.855241 -1.291688 1.518501
C  -1.170607 -0.892364 0.459056
C  0.244138 -1.23126 0.292928
C  -2.004069 -0.145908 -0.393008
C  -3.227908 -0.141698 0.231178
C  1.152376 -0.283594 -0.181369
C  0.729254 -2.493767 0.598407
C  2.495836 -0.583578 -0.354548
C  2.059717 -2.82447 0.44262
C  2.936308 -1.869721 -0.034657
C  -4.084559 -1.120054 2.382113
C  3.048444 1.558117 -1.2176
C  -5.25023 -0.186345 -0.933318
C  2.824845 2.465685 -0.02544
C  2.161838 4.675397 0.551959
C  3.445158 5.38206 0.915935
H  0.781125 0.708358 -0.397014
H  2.403643 -3.821703 0.684218
H  -4.489358 -2.119795 2.246171
H  -4.888857 -0.393975 2.330686
H  -3.61663 -1.052385 3.358427
H  3.884035 1.954807 -1.798517
H  2.175635 1.557878 -1.878799
H  -6.115066 0.45297 -1.092503
H  1.665489 4.262773 1.431443
H  1.468657 5.361949 0.069173
H  3.938256 5.790406 0.033237
H  3.211929 6.215256 1.579978
H  4.145672 4.730381 1.43688
elementType: Cl F O N C H
totalener: -2209.92791345 hartree
nucrepener: 2752.47703570 hartree
electener: -4962.40494914 hartree
oneelecener: -8517.56706224 hartree
twoeener: 3555.16211310 hartree
cpcmener: -0.03487961 hartree
kineticenergy: 2203.72970709 hartree
xcener: -157.828723336143 hartree
chargesum: 0.0000000
charge: -0.060885 -0.075617 -0.210653 -0.201163 -0.194244 -0.306348 -0.318765 -0.293628 -0.435897 0.120127 -0.319455 0.210288 -0.117259 -0.102212 0.204431 -0.146468 0.239670 0.192822 -0.195211 0.035690 -0.169766 0.014667 0.426602 0.391104 0.036536 -0.249848 0.128693 0.129557 0.129701 0.122568 0.123852 0.145732 0.130146 0.137198 0.093481 0.110210 0.088124 0.096040 0.090182
qa: -0.0609 -0.0756 -0.2107 -0.2012 -0.1942 -0.3063 -0.3188 -0.2936 -0.4359 0.1201 -0.3195 0.2103 -0.1173 -0.1022 0.2044 -0.1465 0.2397 0.1928 -0.1952 0.0357 -0.1698 0.0147 0.4266 0.3911 0.0365 -0.2498 0.1287 0.1296 0.1297 0.1226 0.1239 0.1457 0.1301 0.1372 0.0935 0.1102 0.0881 0.0960 0.0902
va: 1.2506 1.2369 1.0807 1.0830 1.0919 2.1044 2.1277 2.1283 2.0674 3.3445 2.9059 3.7662 3.5801 3.9715 4.0796 3.8377 4.0404 4.0241 4.0351 3.8606 3.8794 3.8875 4.2208 4.0885 3.8537 3.9181 1.0217 1.0195 0.9872 0.9981 1.0030 0.9951 1.0031 0.9754 1.0086 0.9952 1.0045 1.0070 1.0117
dispcorr: -0.019363406 hartree
energy: -2209.947276854598
dipole: 10.32008 -12.61438 -2.29429 29.95709 -27.54752 2.40957 12.10229 -12.47123 -0.36894
magnitude: 3.34753 au
magnitude: 8.50874 debye
