program: Orca
programVersion: 5.0.2
elementType: Cl Cl F F F O O O O N N C C C C C C C C C C C C C C C H H H H H H H H H H H H H
charge: 0
multiplicity: 1
keywords: wb97x-d3
keywords: def2-TZVPP
keywords: def2/J RIJCOSX
keywords: DEFGRID2
keywords: scfconv7
keywords: smallprint printgap noloewdin
keywords: NOSOSCF
formula: C15H13Cl2F3N2O4
InChI: InChI=1/C15H13Cl2F3N2O4/c1-3-24-11(23)6-25-10-4-7(9(18)5-8(10)16)13-12(17)14(22(2)21-13)26-15(19)20/h4-5,15H,3,6H2,1-2H3
39 atoms
Cl -2.212326 -2.170986 1.758286
Cl 4.814474 -1.802724 0.388198
F  -0.051359 -2.804238 -0.350306
F  -5.316125 -0.508039 -1.196075
F  -6.380057 -0.826621 0.664107
O  3.813182 0.821048 0.921085
O  -4.406932 0.042415 0.764558
O  3.376611 2.205718 -1.272025
O  2.502681 3.947222 -0.159521
N  -2.557435 1.094742 -0.232925
N  -1.247253 0.946837 -0.367114
C  -0.92659 -0.185373 0.238367
C  0.471999 -0.609793 0.307353
C  -2.074669 -0.775644 0.79035
C  -3.098075 0.077167 0.454775
C  1.460527 0.321949 0.624153
C  0.867878 -1.901999 0.013305
C  2.803387 -0.023861 0.640841
C  2.192497 -2.288007 0.044188
C  3.153876 -1.346573 0.357485
C  -3.240472 2.231326 -0.808523
C  3.52829 2.187411 1.079528
C  -5.176409 -0.882535 0.091324
C  3.060378 2.879657 -0.187228
C  2.903846 2.673988 -2.549132
C  1.519174 2.145888 -2.838187
H  1.138231 1.326608 0.86401
H  2.469254 -3.306431 -0.194436
H  -3.905014 2.685625 -0.077568
H  -3.812334 1.940694 -1.687171
H  -2.487304 2.957082 -1.098318
H  2.80124 2.375097 1.874869
H  4.465228 2.656384 1.389407
H  -4.782303 -1.900103 0.125179
H  3.623733 2.289014 -3.268521
H  2.937067 3.762183 -2.591204
H  1.216717 2.46907 -3.834971
H  1.498007 1.056817 -2.82345
H  0.779582 2.517361 -2.12966
elementType: Cl F O N C H
totalener: -2209.92713433 hartree
nucrepener: 2787.14852892 hartree
electener: -4997.07566325 hartree
oneelecener: -8585.70362737 hartree
twoeener: 3588.62796412 hartree
cpcmener: -0.02890113 hartree
kineticenergy: 2203.73621379 hartree
xcener: -157.829091951459 hartree
chargesum: -0.0000000
charge: -0.058301 -0.073913 -0.213961 -0.197852 -0.188668 -0.309059 -0.304438 -0.267623 -0.449300 0.133755 -0.354695 0.254879 -0.166908 -0.107651 0.228470 -0.178308 0.276596 0.217648 -0.199521 0.046225 -0.167305 0.018749 0.408709 0.378057 0.034551 -0.251726 0.122152 0.130778 0.127646 0.123813 0.118278 0.124974 0.139441 0.123004 0.109202 0.094440 0.105858 0.089439 0.082567
qa: -0.0583 -0.0739 -0.2140 -0.1979 -0.1887 -0.3091 -0.3044 -0.2676 -0.4493 0.1338 -0.3547 0.2549 -0.1669 -0.1077 0.2285 -0.1783 0.2766 0.2176 -0.1995 0.0462 -0.1673 0.0187 0.4087 0.3781 0.0346 -0.2517 0.1222 0.1308 0.1276 0.1238 0.1183 0.1250 0.1394 0.1230 0.1092 0.0944 0.1059 0.0894 0.0826
va: 1.2524 1.2383 1.0771 1.0766 1.0988 2.0997 2.0905 2.1499 2.0583 3.3325 2.8929 3.6635 3.6140 4.0161 4.0653 3.7998 3.9511 3.9414 4.0487 3.8734 3.8828 3.9010 4.2399 4.1081 3.8426 3.9112 1.0426 1.0193 0.9903 0.9922 1.0048 1.0024 0.9897 0.9802 0.9954 1.0124 1.0104 1.0035 1.0188
dispcorr: -0.021310471 hartree
energy: -2209.948444801708
dipole: 13.09356 -13.59084 -0.49728 28.88381 -28.37029 0.51352 -15.02119 14.30041 -0.72078
magnitude: 1.01514 au
magnitude: 2.58029 debye
