program: Orca
programVersion: 5.0.2
elementType: Cl Cl F F F O O O O N N C C C C C C C C C C C C C C C H H H H H H H H H H H H H
charge: 0
multiplicity: 1
keywords: wb97x-d3
keywords: def2-TZVPP
keywords: def2/J RIJCOSX
keywords: DEFGRID2
keywords: scfconv7
keywords: smallprint printgap noloewdin
keywords: NOSOSCF
formula: C15H13Cl2F3N2O4
InChI: InChI=1/C15H13Cl2F3N2O4/c1-3-24-11(23)6-25-10-4-7(9(18)5-8(10)16)13-12(17)14(22(2)21-13)26-15(19)20/h4-5,15H,3,6H2,1-2H3
39 atoms
Cl -1.380738 0.568568 -2.423657
Cl 4.953794 -1.662735 -0.283698
F  0.371536 -3.707068 -0.175423
F  -3.888834 1.968897 -0.891381
F  -4.862941 0.905582 0.705203
O  3.469862 0.765889 -0.497931
O  -4.276425 -0.21887 -1.135038
O  2.428042 2.054999 1.544482
O  1.648536 3.737426 0.283408
N  -3.001821 -1.57304 0.32536
N  -1.742798 -1.912471 0.5561
C  -1.0000 -1.23369 -0.30216
C  0.458052 -1.356499 -0.322707
C  -1.819175 -0.428037 -1.1116
C  -3.09524 -0.670457 -0.666528
C  1.253455 -0.214393 -0.419052
C  1.095443 -2.583203 -0.231572
C  2.638404 -0.2891 -0.413602
C  2.47074 -2.694191 -0.21628
C  3.235549 -1.546988 -0.305447
C  -4.0611 -2.137461 1.130124
C  2.939521 2.038844 -0.762576
C  -4.749162 0.969107 -0.635838
C  2.257101 2.705548 0.41472
C  1.749519 2.532427 2.723217
C  0.308436 2.079517 2.756205
H  0.752641 0.741729 -0.479577
H  2.936761 -3.668157 -0.144449
H  -3.842021 -3.187922 1.300762
H  -5.008934 -2.061074 0.605815
H  -4.1345 -1.625847 2.088159
H  3.785529 2.666266 -1.051959
H  2.245493 2.031665 -1.609509
H  -5.716036 1.168494 -1.092439
H  1.83301 3.617765 2.790803
H  2.309135 2.101311 3.551326
H  -0.144705 2.40927 3.691976
H  -0.278057 2.502656 1.940755
H  0.230082 0.992672 2.714876
elementType: Cl F O N C H
totalener: -2209.92744495 hartree
nucrepener: 2827.56374971 hartree
electener: -5037.49119466 hartree
oneelecener: -8667.16049663 hartree
twoeener: 3629.66930197 hartree
cpcmener: -0.03236294 hartree
kineticenergy: 2203.72733527 hartree
xcener: -157.828125077313 hartree
chargesum: 0.0000000
charge: -0.060138 -0.075154 -0.211197 -0.194537 -0.201522 -0.312054 -0.318025 -0.266642 -0.453654 0.121745 -0.323750 0.217128 -0.086968 -0.107845 0.205816 -0.202900 0.244250 0.218911 -0.193812 0.028357 -0.169932 0.014433 0.427192 0.384047 0.033187 -0.256354 0.137268 0.130189 0.123880 0.122548 0.129245 0.140192 0.126869 0.137716 0.095509 0.110441 0.105062 0.091891 0.088609
qa: -0.0601 -0.0752 -0.2112 -0.1945 -0.2015 -0.3121 -0.3180 -0.2666 -0.4537 0.1217 -0.3238 0.2171 -0.0870 -0.1078 0.2058 -0.2029 0.2442 0.2189 -0.1938 0.0284 -0.1699 0.0144 0.4272 0.3840 0.0332 -0.2564 0.1373 0.1302 0.1239 0.1225 0.1292 0.1402 0.1269 0.1377 0.0955 0.1104 0.1051 0.0919 0.0886
va: 1.2489 1.2369 1.0812 1.0916 1.0829 2.0972 2.1273 2.1556 2.0571 3.3439 2.8805 3.7395 3.5047 3.9730 4.0918 3.8417 4.0339 4.0054 4.0296 3.8597 3.8805 3.9080 4.2192 4.1074 3.8411 3.9106 1.0117 1.0190 1.0023 0.9979 0.9874 0.9921 1.0055 0.9757 1.0104 0.9959 1.0091 1.0126 1.0041
dispcorr: -0.021147749 hartree
energy: -2209.948592695624
dipole: -1.60560 -0.51876 -2.12436 9.99282 -9.98055 0.01227 18.27628 -17.61602 0.66026
magnitude: 2.22464 au
magnitude: 5.65458 debye
