program: Orca
programVersion: 5.0.2
elementType: Cl Cl F F F O O O O N N C C C C C C C C C C C C C C C H H H H H H H H H H H H H
charge: 0
multiplicity: 1
keywords: wb97x-d3
keywords: def2-TZVPP
keywords: def2/J RIJCOSX
keywords: DEFGRID2
keywords: scfconv7
keywords: smallprint printgap noloewdin
keywords: NOSOSCF
formula: C15H13Cl2F3N2O4
InChI: InChI=1/C15H13Cl2F3N2O4/c1-3-24-11(23)6-25-10-4-7(9(18)5-8(10)16)13-12(17)14(22(2)21-13)26-15(19)20/h4-5,15H,3,6H2,1-2H3
39 atoms
Cl -1.353911 1.004683 1.832133
Cl 4.907718 -2.026964 0.447763
F  0.251766 -3.889384 0.381579
F  -4.791167 0.606623 -1.401869
F  -3.663075 2.024951 -0.241339
O  3.515911 0.477682 0.41743
O  -4.235136 0.077268 0.69714
O  1.454033 3.248991 -0.313256
O  2.528109 1.891442 -1.744164
N  -3.041842 -1.713928 -0.28782
N  -1.806205 -2.177621 -0.37972
C  -1.026401 -1.338492 0.283713
C  0.421952 -1.534096 0.353181
C  -1.804948 -0.293619 0.820099
C  -3.086384 -0.570183 0.415302
C  1.2710 -0.426734 0.368624
C  1.012047 -2.789752 0.37288
C  2.650643 -0.554929 0.39899
C  2.382103 -2.95511 0.398988
C  3.197062 -1.839289 0.412575
C  -4.130288 -2.418456 -0.927142
C  3.000708 1.769836 0.611335
C  -4.619197 1.083926 -0.15257
C  2.308857 2.295857 -0.633017
C  0.699295 3.894654 -1.355954
C  1.477181 5.01138 -2.00987
H  0.81398 0.550244 0.337841
H  2.805056 -3.951189 0.417821
H  -3.922947 -3.483812 -0.872729
H  -4.227888 -2.125044 -1.971595
H  -5.06316 -2.21881 -0.40543
H  2.339662 1.821653 1.48121
H  3.859119 2.413226 0.816555
H  -5.545703 1.510809 0.223196
H  -0.182275 4.282785 -0.848276
H  0.365502 3.155511 -2.085448
H  1.804935 5.750305 -1.277957
H  2.349056 4.645088 -2.551253
H  0.830203 5.518648 -2.726778
elementType: Cl F O N C H
totalener: -2209.92656746 hartree
nucrepener: 2804.84806295 hartree
electener: -5014.77463041 hartree
oneelecener: -8621.98135616 hartree
twoeener: 3607.20672575 hartree
cpcmener: -0.03388863 hartree
kineticenergy: 2203.72394654 hartree
xcener: -157.827487502877 hartree
chargesum: -0.0000000
charge: -0.064900 -0.074179 -0.208060 -0.201388 -0.195080 -0.309569 -0.317676 -0.287205 -0.434953 0.120639 -0.316946 0.197865 -0.109073 -0.110260 0.209906 -0.138179 0.226596 0.223757 -0.181486 0.022566 -0.171560 0.023133 0.427002 0.388560 0.036310 -0.248005 0.105565 0.128852 0.123287 0.127419 0.125941 0.127221 0.140852 0.137872 0.107460 0.093037 0.088481 0.090285 0.095912
qa: -0.0649 -0.0742 -0.2081 -0.2014 -0.1951 -0.3096 -0.3177 -0.2872 -0.4350 0.1206 -0.3169 0.1979 -0.1091 -0.1103 0.2099 -0.1382 0.2266 0.2238 -0.1815 0.0226 -0.1716 0.0231 0.4270 0.3886 0.0363 -0.2480 0.1056 0.1289 0.1233 0.1274 0.1259 0.1272 0.1409 0.1379 0.1075 0.0930 0.0885 0.0903 0.0959
va: 1.2441 1.2380 1.0820 1.0830 1.0904 2.1078 2.1279 2.1318 2.0712 3.3417 2.9067 3.7864 3.5825 3.9484 4.0921 3.8393 4.0463 4.0030 4.0228 3.8763 3.8780 3.8859 4.2185 4.0720 3.8498 3.9302 1.0412 1.0193 1.0041 0.9882 0.9951 1.0075 0.9898 0.9753 0.9971 1.0092 1.0038 1.0112 1.0071
dispcorr: -0.020167932 hartree
energy: -2209.946735386894
dipole: -0.61948 -2.23921 -2.85870 19.58728 -17.87118 1.71610 -11.03627 11.60771 0.57144
magnitude: 3.38285 au
magnitude: 8.59853 debye
