program: Orca
programVersion: 5.0.2
elementType: Cl Cl F F F O O O O N N C C C C C C C C C C C C C C C H H H H H H H H H H H H H
charge: 0
multiplicity: 1
keywords: wb97x-d3
keywords: def2-TZVPP
keywords: def2/J RIJCOSX
keywords: DEFGRID2
keywords: scfconv7
keywords: smallprint printgap noloewdin
keywords: NOSOSCF
formula: C15H13Cl2F3N2O4
InChI: InChI=1/C15H13Cl2F3N2O4/c1-3-24-11(23)6-25-10-4-7(9(18)5-8(10)16)13-12(17)14(22(2)21-13)26-15(19)20/h4-5,15H,3,6H2,1-2H3
39 atoms
Cl -1.79685 -0.202769 -1.972453
Cl 4.832814 -1.646004 -0.396288
F  -0.051933 -2.609497 -1.049756
F  -5.015298 0.399274 -1.929575
F  -6.230576 -0.513103 -0.400239
O  3.818093 0.384964 1.345302
O  -4.309132 0.344047 0.167875
O  3.048365 2.351689 -0.253187
O  2.201334 3.546219 1.449985
N  -2.694239 -0.13378 1.766298
N  -1.409048 -0.451306 1.892805
C  -0.934482 -0.565885 0.668166
C  0.477552 -0.858743 0.421128
C  -1.939754 -0.289243 -0.27766
C  -3.055229 -0.019835 0.476905
C  1.467159 -0.115145 1.060169
C  0.873871 -1.859254 -0.446695
C  2.813098 -0.332143 0.808327
C  2.206115 -2.123104 -0.695154
C  3.171483 -1.355197 -0.072396
C  -3.525871 0.066811 2.927668
C  3.509775 1.612236 1.942005
C  -4.971851 -0.3456 -0.820682
C  2.830646 2.619286 1.021177
C  2.327382 3.102968 -1.238585
C  0.929962 2.554515 -1.435843
H  1.140676 0.656708 1.744644
H  2.48789 -2.917629 -1.371964
H  -3.886133 1.092728 2.98127
H  -2.914253 -0.14384 3.798746
H  -4.38003 -0.607955 2.918282
H  2.888937 1.503142 2.837392
H  4.462405 2.034447 2.269184
H  -4.516532 -1.315136 -1.042638
H  2.916015 2.995656 -2.148338
H  2.305487 4.159567 -0.968365
H  0.950055 1.4939 -1.683878
H  0.310725 2.69031 -0.549984
H  0.445802 3.080729 -2.259007
totalener: -2209.90200432 hartree
nucrepener: 2829.55031084 hartree
electener: -5039.45231516 hartree
oneelecener: -8670.01825464 hartree
twoeener: 3630.56593948 hartree
kineticenergy: 2203.79896868 hartree
xcener: -157.838516939454 hartree
chargesum: -0.0000000
charge: -0.042658 -0.053181 -0.199551 -0.167135 -0.176534 -0.283897 -0.274216 -0.248929 -0.349671 0.099591 -0.301427 0.281276 -0.232437 -0.123315 0.216995 -0.158735 0.298435 0.213708 -0.213465 0.063467 -0.167973 0.013990 0.371940 0.297631 0.020258 -0.251776 0.110843 0.114238 0.118068 0.118809 0.111452 0.108954 0.113933 0.098494 0.101259 0.096927 0.077091 0.099486 0.098055
qa: -0.0427 -0.0532 -0.1996 -0.1671 -0.1765 -0.2839 -0.2742 -0.2489 -0.3497 0.0996 -0.3014 0.2813 -0.2324 -0.1233 0.2170 -0.1587 0.2984 0.2137 -0.2135 0.0635 -0.1680 0.0140 0.3719 0.2976 0.0203 -0.2518 0.1108 0.1142 0.1181 0.1188 0.1115 0.1090 0.1139 0.0985 0.1013 0.0969 0.0771 0.0995 0.0981
va: 1.2735 1.2600 1.0973 1.1097 1.1096 2.1295 2.0897 2.1460 2.1520 3.3224 2.9102 3.6132 3.6733 3.9862 4.0369 3.8008 3.9402 3.9107 4.0649 3.9192 3.8909 3.9197 4.3130 4.1662 3.8772 3.9048 1.0436 1.0266 0.9894 1.0093 0.9935 1.0021 0.9949 0.9799 0.9939 1.0098 1.0090 1.0079 1.0134
dispcorr: -0.022390906 hartree
energy: -2209.924395224223
dipole: 8.71075 -9.17162 -0.46087 18.57423 -18.56500 0.00923 12.40859 -12.04586 0.36274
magnitude: 0.58657 au
magnitude: 1.49094 debye
