program: Orca
programVersion: 5.0.2
elementType: Cl Cl F F F O O O O N N C C C C C C C C C C C C C C C H H H H H H H H H H H H H
charge: 0
multiplicity: 1
keywords: wb97x-d3
keywords: def2-TZVPP
keywords: def2/J RIJCOSX
keywords: DEFGRID2
keywords: scfconv7
keywords: smallprint printgap noloewdin
keywords: NOSOSCF
formula: C15H13Cl2F3N2O4
InChI: InChI=1/C15H13Cl2F3N2O4/c1-3-24-11(23)6-25-10-4-7(9(18)5-8(10)16)13-12(17)14(22(2)21-13)26-15(19)20/h4-5,15H,3,6H2,1-2H3
39 atoms
Cl -1.754328 -1.429386 -2.16148
Cl 5.014815 -1.673627 -0.291303
F  0.289052 -3.2790 -0.83744
F  -3.83036 0.960867 -2.004598
F  -4.332124 1.810612 -0.09196
O  3.725714 0.507508 1.057437
O  -4.264349 -0.415366 -0.294488
O  1.496897 3.21603 1.285718
O  2.592092 2.500693 -0.54166
N  -2.640339 -0.347046 1.417092
N  -1.353665 -0.594275 1.618097
C  -0.864465 -1.007044 0.461802
C  0.571133 -1.243112 0.304983
C  -1.874168 -1.02073 -0.518099
C  -2.993544 -0.57571 0.137868
C  1.458953 -0.303218 0.825967
C  1.100709 -2.330646 -0.363988
C  2.826857 -0.402087 0.634224
C  2.463019 -2.478814 -0.541808
C  3.321946 -1.51405 -0.051189
C  -3.464041 0.126549 2.501205
C  3.238723 1.684424 1.63112
C  -4.575001 0.765853 -0.910555
C  2.416932 2.504248 0.640198
C  0.549957 3.956563 0.503956
C  -0.582803 3.071754 0.025004
H  1.023718 0.522615 1.371177
H  2.850479 -3.342265 -1.064419
H  -3.48696 1.214817 2.535777
H  -3.043404 -0.250808 3.428088
H  -4.478704 -0.24801 2.394195
H  2.662234 1.493573 2.542691
H  4.117732 2.264968 1.919667
H  -5.631827 0.735058 -1.171009
H  1.048636 4.445053 -0.334286
H  0.181555 4.729129 1.177526
H  -0.24063 2.324564 -0.689789
H  -1.064234 2.558357 0.857816
H  -1.338362 3.680995 -0.471733
totalener: -2209.90183009 hartree
nucrepener: 2862.43675584 hartree
electener: -5072.33858594 hartree
oneelecener: -8736.47956153 hartree
twoeener: 3664.14097559 hartree
kineticenergy: 2203.79432693 hartree
xcener: -157.834576394479 hartree
chargesum: 0.0000000
charge: -0.035607 -0.055662 -0.197162 -0.173610 -0.198300 -0.277486 -0.310581 -0.272357 -0.323726 0.115502 -0.290366 0.148252 -0.119881 -0.052319 0.174306 -0.145870 0.259553 0.240754 -0.185601 0.021734 -0.182026 0.030827 0.414230 0.281943 0.030972 -0.259783 0.096500 0.112061 0.112514 0.124507 0.117887 0.106813 0.111804 0.112518 0.095921 0.097201 0.107013 0.071421 0.096103
qa: -0.0356 -0.0557 -0.1972 -0.1736 -0.1983 -0.2775 -0.3106 -0.2724 -0.3237 0.1155 -0.2904 0.1483 -0.1199 -0.0523 0.1743 -0.1459 0.2596 0.2408 -0.1856 0.0217 -0.1820 0.0308 0.4142 0.2819 0.0310 -0.2598 0.0965 0.1121 0.1125 0.1245 0.1179 0.1068 0.1118 0.1125 0.0959 0.0972 0.1070 0.0714 0.0961
va: 1.2776 1.2569 1.0996 1.1240 1.0893 2.1439 2.1322 2.1242 2.1722 3.2986 2.8840 3.7672 3.6560 4.0145 4.0487 3.8811 3.9859 3.9581 4.0299 3.9444 3.8934 3.9058 4.2579 4.1753 3.8880 3.9030 1.0489 1.0260 0.9872 1.0073 0.9962 1.0060 0.9940 0.9800 1.0105 0.9944 1.0089 1.0072 1.0136
dispcorr: -0.022590910 hartree
energy: -2209.924421002926
dipole: -4.03556 1.98373 -2.05183 23.67840 -22.50383 1.17457 17.77362 -16.50298 1.27064
magnitude: 2.68405 au
magnitude: 6.82231 debye
