program: Orca
programVersion: 5.0.2
elementType: Cl Cl F F F O O O O N N C C C C C C C C C C C C C C C H H H H H H H H H H H H H
charge: 0
multiplicity: 1
keywords: wb97x-d3
keywords: def2-TZVPP
keywords: def2/J RIJCOSX
keywords: DEFGRID2
keywords: scfconv7
keywords: smallprint printgap noloewdin
keywords: NOSOSCF
formula: C15H13Cl2F3N2O4
InChI: InChI=1/C15H13Cl2F3N2O4/c1-3-24-11(23)6-25-10-4-7(9(18)5-8(10)16)13-12(17)14(22(2)21-13)26-15(19)20/h4-5,15H,3,6H2,1-2H3
39 atoms
Cl -2.320396 -1.882782 2.209583
Cl 4.623368 -1.934878 0.708277
F  -0.264645 -2.983731 0.277838
F  -5.046904 -1.997004 0.443457
F  -5.464028 -0.486576 -1.03671
O  3.68031 0.76237 0.593667
O  -4.539293 0.133384 0.897568
O  2.636509 3.65001 -1.197646
O  3.162664 1.605677 -1.968807
N  -2.713838 0.930366 -0.37193
N  -1.414213 0.727538 -0.529507
C  -1.088538 -0.272383 0.271525
C  0.304009 -0.704821 0.383353
C  -2.221775 -0.721618 0.974414
C  -3.243915 0.070438 0.518625
C  1.317474 0.25114 0.435845
C  0.670021 -2.038515 0.403435
C  2.652638 -0.106117 0.522884
C  1.990288 -2.428064 0.512911
C  2.976736 -1.46354 0.576672
C  -3.38784 1.931358 -1.159389
C  3.43221 2.114005 0.370397
C  -5.41803 -0.721419 0.290041
C  3.063126 2.395951 -1.078794
C  2.275807 4.112356 -2.505095
C  3.482175 4.514209 -3.326427
H  1.01447 1.288774 0.404131
H  2.247497 -3.477866 0.528705
H  -3.699668 1.531695 -2.123291
H  -2.697368 2.753961 -1.320987
H  -4.260557 2.299862 -0.626816
H  2.674471 2.527209 1.046319
H  4.365695 2.634829 0.596028
H  -6.399647 -0.555289 0.731055
H  1.630484 4.971025 -2.322377
H  1.688575 3.349739 -3.01962
H  4.11654 3.65986 -3.555884
H  3.148639 4.942648 -4.272115
H  4.079008 5.268104 -2.813222
totalener: -2209.90361026 hartree
nucrepener: 2753.52018887 hartree
electener: -4963.42379913 hartree
oneelecener: -8519.02292567 hartree
twoeener: 3555.59912655 hartree
kineticenergy: 2203.80326079 hartree
xcener: -157.836379963671 hartree
chargesum: -0.0000000
charge: -0.040778 -0.058735 -0.197533 -0.168287 -0.191617 -0.279973 -0.312703 -0.282329 -0.328937 0.111981 -0.313360 0.230079 -0.188254 -0.073295 0.183546 -0.091319 0.267497 0.222004 -0.202139 0.044676 -0.181606 0.004278 0.414507 0.311742 0.025345 -0.250630 0.087664 0.112387 0.123672 0.118063 0.111835 0.111378 0.121762 0.099261 0.096004 0.094343 0.102538 0.083503 0.083432
qa: -0.0408 -0.0587 -0.1975 -0.1683 -0.1916 -0.2800 -0.3127 -0.2823 -0.3289 0.1120 -0.3134 0.2301 -0.1883 -0.0733 0.1835 -0.0913 0.2675 0.2220 -0.2021 0.0447 -0.1816 0.0043 0.4145 0.3117 0.0253 -0.2506 0.0877 0.1124 0.1237 0.1181 0.1118 0.1114 0.1218 0.0993 0.0960 0.0943 0.1025 0.0835 0.0834
va: 1.2694 1.2542 1.0993 1.1281 1.0940 2.1345 2.1312 2.1179 2.1668 3.3024 2.8789 3.6872 3.7717 4.0069 4.0745 3.8270 3.9746 3.9263 4.0569 3.9296 3.9009 3.9171 4.2740 4.1435 3.8879 3.9093 1.0492 1.0264 0.9877 1.0062 0.9976 1.0007 0.9988 0.9805 0.9945 1.0083 1.0118 1.0104 1.0048
dispcorr: -0.019306849 hartree
energy: -2209.922917106344
dipole: 14.56249 -15.92838 -1.36588 39.60293 -37.30558 2.29735 -19.48832 19.30731 -0.18101
magnitude: 2.67885 au
magnitude: 6.80909 debye
