program: Orca
programVersion: 5.0.2
elementType: Cl Cl F F F O O O O N N C C C C C C C C C C C C C C C H H H H H H H H H H H H H
charge: 0
multiplicity: 1
keywords: wb97x-d3
keywords: def2-TZVPP
keywords: def2/J RIJCOSX
keywords: DEFGRID2
keywords: scfconv7
keywords: smallprint printgap noloewdin
keywords: NOSOSCF
formula: C15H13Cl2F3N2O4
InChI: InChI=1/C15H13Cl2F3N2O4/c1-3-24-11(23)6-25-10-4-7(9(18)5-8(10)16)13-12(17)14(22(2)21-13)26-15(19)20/h4-5,15H,3,6H2,1-2H3
39 atoms
Cl -1.565326 1.11679 1.803999
Cl 4.834843 -1.666952 0.970967
F  0.265338 -3.422156 -0.110888
F  -5.701685 -0.907863 0.89877
F  -5.810877 1.210827 1.329791
O  3.483664 0.851949 0.931353
O  -4.226145 0.513179 0.030359
O  3.117572 1.926997 -1.451327
O  1.967958 3.670873 -0.627893
N  -2.877432 -1.088033 -1.049811
N  -1.627429 -1.528153 -1.065075
C  -0.97946 -0.867236 -0.12199
C  0.442989 -1.084773 0.141917
C  -1.852207 0.04155 0.510358
C  -3.056887 -0.133925 -0.120742
C  1.274298 0.003605 0.411947
C  1.014993 -2.347155 0.132796
C  2.62784 -0.152103 0.666951
C  2.359233 -2.535006 0.389778
C  3.161416 -1.442509 0.656608
C  -3.847493 -1.594713 -1.990974
C  3.012507 2.166425 0.896515
C  -4.97028 0.198142 1.142089
C  2.625869 2.678076 -0.483829
C  2.727597 2.222209 -2.797998
C  1.360805 1.654147 -3.116349
H  0.82815 0.987919 0.399786
H  2.776131 -3.532524 0.38505
H  -3.385435 -2.429635 -2.507163
H  -4.125538 -0.831768 -2.716189
H  -4.740802 -1.940007 -1.476389
H  2.161674 2.327905 1.567882
H  3.829187 2.788819 1.268462
H  -4.364384 0.030263 2.036397
H  3.494488 1.753567 -3.412473
H  2.75922 3.298467 -2.973598
H  1.144297 1.801676 -4.174793
H  1.318427 0.584711 -2.911072
H  0.575058 2.148934 -2.547231
totalener: -2209.90333454 hartree
nucrepener: 2796.43612731 hartree
electener: -5006.33946185 hartree
oneelecener: -8603.63936734 hartree
twoeener: 3597.29990549 hartree
kineticenergy: 2203.78991065 hartree
xcener: -157.835521300282 hartree
chargesum: 0.0000000
charge: -0.053936 -0.054508 -0.188917 -0.188510 -0.166932 -0.279567 -0.282313 -0.245743 -0.351260 0.105245 -0.281032 0.214139 -0.095759 -0.116655 0.198207 -0.212696 0.250205 0.244265 -0.200298 0.035135 -0.167732 0.004482 0.398518 0.300328 0.020211 -0.257810 0.113592 0.113308 0.120273 0.115940 0.113388 0.110796 0.117355 0.087989 0.102225 0.093768 0.093436 0.093306 0.097558
qa: -0.0539 -0.0545 -0.1889 -0.1885 -0.1669 -0.2796 -0.2823 -0.2457 -0.3513 0.1052 -0.2810 0.2141 -0.0958 -0.1167 0.1982 -0.2127 0.2502 0.2443 -0.2003 0.0351 -0.1677 0.0045 0.3985 0.3003 0.0202 -0.2578 0.1136 0.1133 0.1203 0.1159 0.1134 0.1108 0.1174 0.0880 0.1022 0.0938 0.0934 0.0933 0.0976
va: 1.2582 1.2586 1.1136 1.0901 1.1268 2.1343 2.1019 2.1559 2.1521 3.3449 2.8846 3.7308 3.5316 3.9948 4.0412 3.8370 4.0562 3.9479 4.0407 3.9203 3.8867 3.9331 4.2884 4.1527 3.8711 3.9035 1.0243 1.0266 1.0086 0.9888 1.0009 1.0064 0.9949 0.9873 0.9945 1.0092 1.0123 1.0032 1.0110
dispcorr: -0.021250476 hartree
energy: -2209.924585017952
dipole: 8.50185 -8.89349 -0.39163 10.45929 -10.58427 -0.12498 -22.20998 21.58711 -0.62286
magnitude: 0.74629 au
magnitude: 1.89693 debye
