program: Orca
programVersion: 5.0.2
elementType: Cl N N N N N N C C C C C C C C C C C C C C C H H H H H H H H H H H H H H H
charge: 0
multiplicity: 1
keywords: wb97x-d3
keywords: def2-TZVPP
keywords: def2/J RIJCOSX
keywords: DEFGRID2
keywords: scfconv7
keywords: smallprint printgap noloewdin
keywords: NOSOSCF
formula: C15H15ClN6
InChI: InChI=1/C15H15ClN6/c1-3-7-20(2)15-11(9-17)10-18-22(15)14-13(16)12-6-4-5-8-21(12)19-14/h1,10H,4-8H2,2H3
37 atoms
Cl 0.492826 1.8157 -1.453247
N  2.329079 -0.484596 0.997042
N  1.140259 -0.538252 1.577101
N  -0.983827 0.405022 1.137723
N  -1.936027 -0.667036 -0.772432
N  -1.337238 1.122051 2.232123
N  -5.642707 0.371267 0.460981
C  4.824237 0.022985 -0.163793
C  3.57943 0.454466 -0.934669
C  4.576226 -1.297556 0.554421
C  3.474717 -1.154143 1.58926
C  2.357878 0.289626 -0.104139
C  1.075891 0.777118 -0.236194
C  0.367487 0.226564 0.835044
C  -2.045869 0.042551 0.375712
C  -3.155977 0.5900 1.021704
C  -2.62944 1.243294 2.162276
C  -1.117125 -1.868537 -0.842058
C  -2.988194 -0.580845 -1.763156
C  -4.515568 0.460889 0.694393
C  -0.118102 -1.803346 -1.906315
C  0.687286 -1.756399 -2.796242
H  5.664227 -0.06956 -0.852395
H  5.094738 0.791678 0.565202
H  3.468688 -0.154906 -1.837706
H  3.660342 1.489717 -1.270084
H  4.304918 -2.070351 -0.170284
H  5.478874 -1.63902 1.062008
H  3.143559 -2.122842 1.960703
H  3.819508 -0.565326 2.441997
H  -3.182517 1.77797 2.91943
H  -0.628668 -2.06217 0.112776
H  -1.767689 -2.732302 -1.019066
H  -2.575047 -0.84589 -2.736492
H  -3.359259 0.43927 -1.84008
H  -3.824444 -1.254074 -1.555215
H  1.402685 -1.708376 -3.58659
elementType: Cl N C H
totalener: -1369.31576574 hartree
nucrepener: 1954.56205546 hartree
electener: -3323.87782120 hartree
oneelecener: -5752.21591284 hartree
twoeener: 2428.33809164 hartree
cpcmener: -0.03449220 hartree
kineticenergy: 1364.74531055 hartree
xcener: -109.693979029418 hartree
chargesum: 0.0000000
charge: -0.068541 0.179071 -0.319068 0.161340 -0.139133 -0.336983 -0.124185 -0.138031 -0.075542 -0.128209 -0.051475 -0.011818 -0.065069 0.028377 0.140338 -0.033250 -0.056750 -0.089545 -0.216619 -0.152119 -0.411358 0.072731 0.084202 0.082840 0.095962 0.091873 0.081011 0.085208 0.105303 0.110476 0.169799 0.146517 0.141343 0.113327 0.120461 0.124976 0.282539
qa: -0.0685 0.1791 -0.3191 0.1613 -0.1391 -0.3370 -0.1242 -0.1380 -0.0755 -0.1282 -0.0515 -0.0118 -0.0651 0.0284 0.1403 -0.0332 -0.0568 -0.0895 -0.2166 -0.1521 -0.4114 0.0727 0.0842 0.0828 0.0960 0.0919 0.0810 0.0852 0.1053 0.1105 0.1698 0.1465 0.1413 0.1133 0.1205 0.1250 0.2825
va: 1.2463 3.3333 2.9245 3.2246 3.1347 2.8690 3.1460 3.9318 3.9142 3.9199 3.8768 3.9215 3.9323 4.1494 4.1716 3.6196 4.1229 3.9121 3.9183 4.0408 3.7139 3.5710 1.0105 1.0094 1.0058 1.0133 1.0112 1.0141 1.0077 0.9948 1.0013 1.0006 0.9863 0.9955 0.9898 0.9886 0.9505
dispcorr: -0.021459026 hartree
energy: -1369.337224765840
dipole: 18.69130 -14.53063 4.16068 -12.66892 11.23244 -1.43649 -3.60067 2.24246 -1.35822
magnitude: 4.60646 au
magnitude: 11.70869 debye
