program: Orca
programVersion: 5.0.2
elementType: Cl N N N N N N C C C C C C C C C C C C C C C H H H H H H H H H H H H H H H
charge: 0
multiplicity: 1
keywords: wb97x-d3
keywords: def2-TZVPP
keywords: def2/J RIJCOSX
keywords: DEFGRID2
keywords: scfconv7
keywords: smallprint printgap noloewdin
keywords: NOSOSCF
formula: C15H15ClN6
InChI: InChI=1/C15H15ClN6/c1-3-7-20(2)15-11(9-17)10-18-22(15)14-13(16)12-6-4-5-8-21(12)19-14/h1,10H,4-8H2,2H3
37 atoms
Cl 0.597926 1.0849 2.292691
N  2.216136 -0.011703 -1.002534
N  1.005576 0.22434 -1.477204
N  -1.046736 0.969509 -0.545686
N  -2.049578 -1.176318 -0.209399
N  -1.378031 2.282311 -0.635517
N  -5.719628 0.478619 -0.264034
C  4.784081 -0.092022 0.087061
C  3.610561 0.029185 1.054997
C  4.428665 -1.022049 -1.065715
C  3.280984 -0.45889 -1.88457
C  2.336983 0.236109 0.316182
C  1.087544 0.653739 0.718095
C  0.303984 0.624658 -0.438201
C  -2.126196 0.165134 -0.371758
C  -3.222043 1.029519 -0.352929
C  -2.671077 2.323428 -0.514831
C  -1.219229 -1.998727 -1.074747
C  -3.115325 -1.873651 0.481733
C  -4.588288 0.708219 -0.295871
C  -0.063879 -2.571163 -0.387357
C  0.888205 -3.04257 0.174828
H  5.047324 0.894528 -0.304815
H  5.658683 -0.464532 0.62081
H  3.762988 0.84915 1.758934
H  3.525595 -0.881844 1.655272
H  5.28267 -1.162112 -1.729335
H  4.160011 -2.008943 -0.677769
H  3.614322 0.390296 -2.485025
H  2.866424 -1.206588 -2.559626
H  -3.207577 3.259067 -0.556887
H  -1.835886 -2.808807 -1.475665
H  -0.880823 -1.42923 -1.940572
H  -3.953174 -2.125347 -0.173637
H  -3.48042 -1.282503 1.319577
H  -2.71615 -2.800386 0.893196
H  1.727776 -3.462957 0.681227
elementType: Cl N C H
totalener: -1369.31595766 hartree
nucrepener: 1950.09864493 hartree
electener: -3319.41460258 hartree
oneelecener: -5743.50220572 hartree
twoeener: 2424.08760314 hartree
cpcmener: -0.03417831 hartree
kineticenergy: 1364.74721059 hartree
xcener: -109.692903495686 hartree
chargesum: 0.0000000
charge: -0.066745 0.210655 -0.331048 0.144587 -0.149694 -0.332120 -0.125496 -0.137248 -0.085326 -0.129149 -0.070118 -0.057708 -0.017601 0.023896 0.151757 -0.023859 -0.060484 -0.082377 -0.211864 -0.150173 -0.420164 0.068990 0.082972 0.085069 0.095043 0.097791 0.086457 0.082158 0.117624 0.112663 0.169841 0.139593 0.141123 0.124105 0.120344 0.113071 0.283433
qa: -0.0667 0.2107 -0.3310 0.1446 -0.1497 -0.3321 -0.1255 -0.1372 -0.0853 -0.1291 -0.0701 -0.0577 -0.0176 0.0239 0.1518 -0.0239 -0.0605 -0.0824 -0.2119 -0.1502 -0.4202 0.0690 0.0830 0.0851 0.0950 0.0978 0.0865 0.0822 0.1176 0.1127 0.1698 0.1396 0.1411 0.1241 0.1203 0.1131 0.2834
va: 1.2531 3.2721 2.8576 3.2361 3.1427 2.8479 3.1459 3.9217 3.9083 3.9167 3.8695 3.9456 3.9538 4.1063 4.1598 3.5954 4.1299 3.9043 3.9139 4.0398 3.7269 3.5625 1.0092 1.0104 1.0116 1.0041 1.0151 1.0117 0.9960 1.0048 1.0008 0.9874 1.0111 0.9871 0.9900 0.9946 0.9499
dispcorr: -0.021482270 hartree
energy: -1369.337439925130
dipole: 18.01200 -13.87681 4.13519 -14.77381 12.70595 -2.06786 -6.78080 6.66228 -0.11852
magnitude: 4.62492 au
magnitude: 11.75561 debye
