program: Orca
programVersion: 5.0.2
elementType: Cl N N N N N N C C C C C C C C C C C C C C C H H H H H H H H H H H H H H H
charge: 0
multiplicity: 1
keywords: wb97x-d3
keywords: def2-TZVPP
keywords: def2/J RIJCOSX
keywords: DEFGRID2
keywords: scfconv7
keywords: smallprint printgap noloewdin
keywords: NOSOSCF
formula: C15H15ClN6
InChI: InChI=1/C15H15ClN6/c1-3-7-20(2)15-11(9-17)10-18-22(15)14-13(16)12-6-4-5-8-21(12)19-14/h1,10H,4-8H2,2H3
37 atoms
Cl 0.903271 2.561821 -0.602869
N  2.478374 -0.655976 0.756161
N  1.227086 -0.922569 1.093311
N  -0.843042 0.215832 0.889769
N  -1.53081 -0.403777 -1.306845
N  -1.317998 0.670289 2.067156
N  -5.398311 0.336001 -0.278389
C  4.976293 -0.102577 -0.375233
C  3.952358 1.027749 -0.327108
C  4.888941 -0.95801 0.882192
C  3.532312 -1.629574 0.991526
C  2.62831 0.524609 0.12509
C  1.361419 1.06356 0.066906
C  0.537135 0.120987 0.685328
C  -1.812848 0.033604 -0.036875
C  -2.993084 0.407087 0.595064
C  -2.603797 0.791935 1.899739
C  -1.054565 -1.778392 -1.434111
C  -2.45578 -0.006902 -2.353396
C  -4.307543 0.363776 0.095678
C  -2.104407 -2.768917 -1.192484
C  -2.987712 -3.555691 -0.979779
H  4.802144 -0.725026 -1.257201
H  5.976189 0.319454 -0.478415
H  3.847618 1.506958 -1.301857
H  4.287492 1.806318 0.364685
H  5.653284 -1.735768 0.875232
H  5.070248 -0.34023 1.766041
H  3.435597 -2.428769 0.253664
H  3.376799 -2.061871 1.97872
H  -3.241735 1.142617 2.696414
H  -0.652031 -1.900485 -2.44128
H  -0.225199 -1.960062 -0.750453
H  -1.966529 -0.15009 -3.316657
H  -2.694086 1.050957 -2.259824
H  -3.386718 -0.580773 -2.361657
H  -3.770429 -4.256056 -0.792036
elementType: Cl N C H
totalener: -1369.31659818 hartree
nucrepener: 1917.02300018 hartree
electener: -3286.33959836 hartree
oneelecener: -5677.24787012 hartree
twoeener: 2390.90827176 hartree
cpcmener: -0.03387482 hartree
kineticenergy: 1364.75673446 hartree
xcener: -109.687834165038 hartree
chargesum: 0.0000000
charge: -0.066679 0.174826 -0.343364 0.175342 -0.153617 -0.322894 -0.113947 -0.137946 -0.094932 -0.127744 -0.050737 0.022268 -0.076559 0.056590 0.057571 0.055237 -0.061141 -0.056155 -0.215214 -0.173791 -0.426723 0.039760 0.081878 0.084747 0.092527 0.100715 0.084652 0.083453 0.109594 0.107998 0.171732 0.133895 0.151463 0.115530 0.125924 0.111275 0.284465
qa: -0.0667 0.1748 -0.3434 0.1753 -0.1536 -0.3229 -0.1139 -0.1379 -0.0949 -0.1277 -0.0507 0.0223 -0.0766 0.0566 0.0576 0.0552 -0.0611 -0.0562 -0.2152 -0.1738 -0.4267 0.0398 0.0819 0.0847 0.0925 0.1007 0.0847 0.0835 0.1096 0.1080 0.1717 0.1339 0.1515 0.1155 0.1259 0.1113 0.2845
va: 1.2522 3.3253 2.8966 3.2586 3.0867 2.8512 3.1413 3.9277 3.9159 3.9214 3.8800 3.9095 3.9850 4.1064 4.2538 3.5899 4.1170 3.8390 3.9175 4.0378 3.7006 3.6399 1.0096 1.0101 1.0117 1.0017 1.0142 1.0098 0.9950 1.0068 1.0001 0.9916 1.0070 0.9983 0.9885 0.9917 0.9483
dispcorr: -0.019756758 hartree
energy: -1369.336354937831
dipole: 18.16551 -13.72645 4.43907 -12.79796 11.98216 -0.81579 -5.77802 4.66371 -1.11431
magnitude: 4.64892 au
magnitude: 11.81663 debye
