program: Orca
programVersion: 5.0.2
elementType: Cl N N N N N N C C C C C C C C C C C C C C C H H H H H H H H H H H H H H H
charge: 0
multiplicity: 1
keywords: wb97x-d3
keywords: def2-TZVPP
keywords: def2/J RIJCOSX
keywords: DEFGRID2
keywords: scfconv7
keywords: smallprint printgap noloewdin
keywords: NOSOSCF
formula: C15H15ClN6
InChI: InChI=1/C15H15ClN6/c1-3-7-20(2)15-11(9-17)10-18-22(15)14-13(16)12-6-4-5-8-21(12)19-14/h1,10H,4-8H2,2H3
37 atoms
Cl 1.129944 1.652157 2.006501
N  2.229159 -0.392191 -1.038808
N  0.947281 -0.291371 -1.362497
N  -0.957432 0.707665 -0.375446
N  -1.940823 -1.482493 -0.483132
N  -1.309084 2.016932 -0.348093
N  -5.64737 0.219104 -0.480777
C  4.939885 -0.156066 -0.405821
C  3.926185 0.260436 0.65582
C  4.44625 -1.381778 -1.164599
C  3.164638 -1.073485 -1.917748
C  2.545139 0.242654 0.105135
C  1.359519 0.772415 0.566659
C  0.404788 0.404902 -0.386273
C  -2.025842 -0.12802 -0.447516
C  -3.137853 0.720496 -0.483885
C  -2.604762 2.029775 -0.420753
C  -0.980522 -2.181994 0.369566
C  -3.143092 -2.226669 -0.81248
C  -4.509007 0.413144 -0.486589
C  -0.915936 -1.64908 1.72606
C  -0.85177 -1.165405 2.823693
H  5.10434 0.66685 -1.106975
H  5.899024 -0.362291 0.069633
H  4.150263 1.254752 1.046113
H  3.975205 -0.423029 1.508894
H  5.191976 -1.718341 -1.885604
H  4.279827 -2.208924 -0.468867
H  3.366502 -0.431708 -2.77804
H  2.6849 -1.98135 -2.280836
H  -3.157216 2.957007 -0.421354
H  -1.287843 -3.227177 0.406335
H  0.016653 -2.183814 -0.07372
H  -2.857834 -3.236302 -1.101858
H  -3.640857 -1.781387 -1.671408
H  -3.848985 -2.295333 0.019328
H  -0.800007 -0.744442 3.802577
elementType: Cl N C H
totalener: -1369.31455563 hartree
nucrepener: 1943.85448900 hartree
electener: -3313.16904463 hartree
oneelecener: -5731.25410637 hartree
twoeener: 2418.08506174 hartree
cpcmener: -0.03504819 hartree
kineticenergy: 1364.74411567 hartree
xcener: -109.695691592732 hartree
chargesum: 0.0000000
charge: -0.067838 0.174876 -0.353674 0.204885 -0.157455 -0.327746 -0.125501 -0.138841 -0.092571 -0.130412 -0.055972 0.031945 -0.070307 0.026062 0.103346 0.003945 -0.066270 -0.035640 -0.208050 -0.160321 -0.415165 0.030537 0.082620 0.084913 0.093863 0.099860 0.084289 0.082771 0.112631 0.106080 0.168631 0.129122 0.141212 0.110279 0.119588 0.130000 0.284308
qa: -0.0678 0.1749 -0.3537 0.2049 -0.1575 -0.3277 -0.1255 -0.1388 -0.0926 -0.1304 -0.0560 0.0319 -0.0703 0.0261 0.1033 0.0039 -0.0663 -0.0356 -0.2081 -0.1603 -0.4152 0.0305 0.0826 0.0849 0.0939 0.0999 0.0843 0.0828 0.1126 0.1061 0.1686 0.1291 0.1412 0.1103 0.1196 0.1300 0.2843
va: 1.2473 3.3005 2.8905 3.2408 3.1704 2.8424 3.1483 3.9280 3.9162 3.9234 3.8755 3.9065 3.9298 4.1392 4.1934 3.6079 4.1338 3.9090 3.9049 4.0506 3.7259 3.6553 1.0094 1.0103 1.0114 1.0024 1.0142 1.0104 0.9956 1.0060 1.0006 0.9904 0.9905 0.9969 0.9887 0.9832 0.9534
dispcorr: -0.020611491 hartree
energy: -1369.335167116348
dipole: 16.45730 -12.15591 4.30139 -16.63865 14.40956 -2.22909 -7.57101 7.41138 -0.15963
magnitude: 4.84730 au
magnitude: 12.32085 debye
