program: Orca
programVersion: 5.0.2
elementType: Cl N N N N N N C C C C C C C C C C C C C C C H H H H H H H H H H H H H H H
charge: 0
multiplicity: 1
keywords: wb97x-d3
keywords: def2-TZVPP
keywords: def2/J RIJCOSX
keywords: DEFGRID2
keywords: scfconv7
keywords: smallprint printgap noloewdin
keywords: NOSOSCF
formula: C15H15ClN6
InChI: InChI=1/C15H15ClN6/c1-3-7-20(2)15-11(9-17)10-18-22(15)14-13(16)12-6-4-5-8-21(12)19-14/h1,10H,4-8H2,2H3
37 atoms
Cl 1.191624 2.368051 -1.109934
N  2.185856 -0.755496 0.870213
N  0.887884 -0.795645 1.137822
N  -0.983651 0.534375 0.569881
N  -1.934606 -1.530697 -0.198698
N  -1.35381 1.753287 1.034193
N  -5.662032 -0.006056 0.356415
C  4.783882 -0.740381 -0.15714
C  3.947367 0.52476 -0.32547
C  4.514155 -1.379409 1.199621
C  3.066459 -1.822259 1.315095
C  2.541007 0.284454 0.092994
C  1.370623 0.96664 -0.159431
C  0.379521 0.244744 0.512544
C  -2.040985 -0.269732 0.287565
C  -3.166179 0.493618 0.616136
C  -2.651307 1.730512 1.071919
C  -0.955962 -1.848323 -1.237637
C  -3.104804 -2.386657 -0.152821
C  -4.529732 0.191903 0.465188
C  -0.814402 -0.800101 -2.241775
C  -0.675764 0.080268 -3.046968
H  4.547072 -1.451632 -0.953484
H  5.840875 -0.492609 -0.257635
H  3.965455 0.876984 -1.35829
H  4.365044 1.33231 0.283446
H  5.149194 -2.253061 1.350306
H  4.751868 -0.670773 1.997866
H  2.883117 -2.703086 0.695628
H  2.804502 -2.073361 2.342221
H  -3.217302 2.584949 1.410685
H  0.019899 -2.083295 -0.807593
H  -1.294174 -2.762706 -1.726041
H  -3.811539 -2.192287 -0.963893
H  -3.615448 -2.280465 0.801975
H  -2.780436 -3.423693 -0.223118
H  -0.556881 0.858838 -3.766913
elementType: Cl N C H
totalener: -1369.31411480 hartree
nucrepener: 1945.44178593 hartree
electener: -3314.75590072 hartree
oneelecener: -5734.46553624 hartree
twoeener: 2419.70963551 hartree
cpcmener: -0.03496767 hartree
kineticenergy: 1364.74948706 hartree
xcener: -109.697253641935 hartree
chargesum: -0.0000000
charge: -0.068378 0.171944 -0.354829 0.206315 -0.154882 -0.329952 -0.124830 -0.136794 -0.092841 -0.130299 -0.050545 0.033318 -0.072351 0.030721 0.107274 -0.003527 -0.065053 -0.035093 -0.212612 -0.157324 -0.430409 0.049859 0.081495 0.084834 0.090345 0.099881 0.084859 0.083243 0.106659 0.106755 0.168998 0.137740 0.128744 0.130785 0.119727 0.111965 0.284257
qa: -0.0684 0.1719 -0.3548 0.2063 -0.1549 -0.3300 -0.1248 -0.1368 -0.0928 -0.1303 -0.0505 0.0333 -0.0724 0.0307 0.1073 -0.0035 -0.0651 -0.0351 -0.2126 -0.1573 -0.4304 0.0499 0.0815 0.0848 0.0903 0.0999 0.0849 0.0832 0.1067 0.1068 0.1690 0.1377 0.1287 0.1308 0.1197 0.1120 0.2843
va: 1.2471 3.3023 2.8973 3.2377 3.1717 2.8427 3.1485 3.9238 3.9149 3.9251 3.8798 3.9010 3.9260 4.1415 4.1904 3.6143 4.1329 3.9082 3.9049 4.0479 3.7479 3.6358 1.0099 1.0100 1.0133 1.0020 1.0142 1.0098 0.9946 1.0068 1.0005 0.9892 0.9895 0.9821 0.9891 0.9949 0.9539
dispcorr: -0.020657155 hartree
energy: -1369.334771951832
dipole: 16.34357 -12.04443 4.29913 -18.84430 16.68999 -2.15432 0.76806 -1.35835 -0.59029
magnitude: 4.84480 au
magnitude: 12.31450 debye
