program: Orca
programVersion: 5.0.2
elementType: Cl N N N N N N C C C C C C C C C C C C C C C H H H H H H H H H H H H H H H
charge: 0
multiplicity: 1
keywords: wb97x-d3
keywords: def2-TZVPP
keywords: def2/J RIJCOSX
keywords: DEFGRID2
keywords: scfconv7
keywords: smallprint printgap noloewdin
keywords: NOSOSCF
formula: C15H15ClN6
InChI: InChI=1/C15H15ClN6/c1-3-7-20(2)15-11(9-17)10-18-22(15)14-13(16)12-6-4-5-8-21(12)19-14/h1,10H,4-8H2,2H3
37 atoms
Cl 0.388074 -1.115834 2.36678
N  2.652454 0.703646 -0.128345
N  1.512826 1.265924 -0.497651
N  -0.738347 1.110347 0.216946
N  -1.533318 -1.017605 -0.480928
N  -1.137705 2.345052 0.557191
N  -5.345115 0.396565 -0.410554
C  4.874002 -0.869767 0.506767
C  3.667931 -0.938722 1.440754
C  5.074754 0.554373 -0.001092
C  3.883268 1.007569 -0.829701
C  2.512191 -0.199322 0.865496
C  1.171306 -0.194902 1.170014
C  0.605278 0.739715 0.293365
C  -1.764699 0.288689 -0.108798
C  -2.909471 1.05178 0.046863
C  -2.438328 2.319089 0.4676
C  -0.977717 -1.207057 -1.814331
C  -2.540669 -1.990214 -0.103253
C  -4.245653 0.678371 -0.20815
C  -1.95858 -1.006226 -2.88134
C  -2.80071 -0.834936 -3.718744
H  5.764928 -1.217151 1.030504
H  4.726836 -1.543861 -0.341905
H  3.923796 -0.50196 2.411001
H  3.378618 -1.971973 1.639694
H  5.217946 1.232008 0.845226
H  5.972734 0.624482 -0.616043
H  3.906001 2.079614 -1.01978
H  3.87443 0.499537 -1.797494
H  -3.02549 3.194815 0.69448
H  -0.133213 -0.53046 -1.958736
H  -0.572316 -2.220424 -1.868786
H  -2.104668 -2.986972 -0.176748
H  -3.438676 -1.961343 -0.72611
H  -2.828241 -1.830976 0.933876
H  -3.547099 -0.673653 -4.459216
totalener: -1369.28895017 hartree
nucrepener: 1925.25918840 hartree
electener: -3294.54813857 hartree
oneelecener: -5693.52970918 hartree
twoeener: 2398.98157061 hartree
kineticenergy: 1364.80213853 hartree
xcener: -109.693786994836 hartree
chargesum: 0.0000000
charge: -0.056083 0.165542 -0.298685 0.183032 -0.138830 -0.274622 -0.020241 -0.143684 -0.113845 -0.138403 -0.060121 -0.018953 -0.039995 0.060417 0.017160 0.068459 -0.050538 -0.121547 -0.210847 -0.234514 -0.391804 0.116158 0.085701 0.079025 0.098496 0.092938 0.083122 0.083634 0.106415 0.098510 0.139702 0.135438 0.115414 0.097118 0.123093 0.115978 0.247359
qa: -0.0561 0.1655 -0.2987 0.1830 -0.1388 -0.2746 -0.0202 -0.1437 -0.1138 -0.1384 -0.0601 -0.0190 -0.0400 0.0604 0.0172 0.0685 -0.0505 -0.1215 -0.2108 -0.2345 -0.3918 0.1162 0.0857 0.0790 0.0985 0.0929 0.0831 0.0836 0.1064 0.0985 0.1397 0.1354 0.1154 0.0971 0.1231 0.1160 0.2474
va: 1.2612 3.2883 2.8802 3.2873 3.0189 2.8771 3.1529 3.9089 3.9155 3.9077 3.8868 3.9084 3.9787 4.0780 4.2767 3.6364 4.1025 3.9207 3.9309 4.0181 3.7521 3.6653 1.0126 1.0115 1.0020 1.0148 1.0110 1.0159 1.0103 0.9955 1.0082 0.9972 0.9890 0.9979 0.9952 0.9946 0.9717
dispcorr: -0.020210975 hartree
energy: -1369.309161148776
dipole: 19.40103 -16.01067 3.39036 -6.31367 5.25702 -1.05665 -8.64141 8.54229 -0.09912
magnitude: 3.55258 au
magnitude: 9.02995 debye
